{"text_format":"1","workbook":"xlsx","n_sheets":3,"sheets":["m3u8","txt","Sheet2"],"not_rendered":{"charts":0,"images":0,"macros":1,"external_links":0,"defined_names":3,"comments":0,"pivot_tables":0},"unopened":[],"bounds":{"document_bytes":16777216,"sheet_cells":100000,"rows_first":2000,"rows_last":500,"rows_between":2000,"halvings":0,"cell_chars":16384,"cell_head_chars":4096},"cells_cut":0,"cells_raw":0,"read":"whole","date_system":"1900"}

{"sheet":"m3u8","index":0,"n_rows":934,"n_cols":8,"rows_kept":934,"cut":false,"hidden":false,"merged":[]}
["扫描结果",null,null,null,"匹配","提取信息","信息","m3u8"]
["239.77.0.1:5146","HD (V: h264; A: mp2@2ch)",null,null,{"$f":"IFERROR(VLOOKUP(F2,A:A,1,0),\"-\")","v":"-"},{"$f":"IF(LEFT(H2,1)=\"#\",\"\",MID(H2,FIND(\"rtp\",H2)+4,LEN(H2)-FIND(\"rtp\",H2)-3))","v":""},{"$f":"VLOOKUP(F2,A:B,2,0)","v":{"$error":"#N/A"}},"#EXTINF:-1 tvg-name=\"CCTV -1综合高清\",CCTV -1综合高清"]
["239.77.0.2:5146","4K (V: hevc; A: aac@2ch)",null,null,{"$f":"IFERROR(VLOOKUP(F3,A:A,1,0),\"-\")","v":"239.77.0.86:5146"},{"$f":"IF(LEFT(H3,1)=\"#\",\"\",MID(H3,FIND(\"rtp\",H3)+4,LEN(H3)-FIND(\"rtp\",H3)-3))","v":"239.77.0.86:5146"},{"$f":"VLOOKUP(F3,A:B,2,0)","v":"HD (V: h264; A: mp2@2ch)"},"http://faim.top:12306/rtp/239.77.0.86:5146"]
["239.77.0.3:5146","4K (V: hevc; A: ac3@6ch)",null,null,"-","",{"$f":"VLOOKUP(F4,A:B,2,0)","v":{"$error":"#N/A"}},"#EXTINF:-1 tvg-name=\"CCTV -2财经高清\",CCTV -2财经高清"]
["239.77.0.10:5146","SD (V: h264; A: mp2@2ch)",null,null,"239.77.0.137:5146","239.77.0.137:5146",{"$f":"VLOOKUP(F5,A:B,2,0)","v":"HD (V: h264; A: mp2@2ch)"},"http://faim.top:12306/rtp/239.77.0.137:5146"]
["239.77.0.14:5146","SD (V: h264; A: mp2@2ch)",null,null,"-","",{"$f":"VLOOKUP(F6,A:B,2,0)","v":{"$error":"#N/A"}},"#EXTINF:-1 tvg-name=\"CCTV -7军事农业高清\",CCTV -7军事农业高清"]
["239.77.0.15:5146","HD (V: h264; A: mp2@2ch)",null,null,"239.77.0.138:5146","239.77.0.138:5146",{"$f":"VLOOKUP(F7,A:B,2,0)","v":"HD (V: h264; A: mp2@2ch)"},"http://faim.top:12306/rtp/239.77.0.138:5146"]
["239.77.0.17:5146","HD (V: h264; A: mp2@2ch)",null,null,"-","",{"$f":"VLOOKUP(F8,A:B,2,0)","v":{"$error":"#N/A"}},"#EXTINF:-1 tvg-name=\"CCTV-10科教高清\",CCTV-10科教高清"]
["239.77.0.19:5146","HD (V: h264; A: mp2@2ch)",null,null,"239.77.0.134:5146","239.77.0.134:5146",{"$f":"VLOOKUP(F9,A:B,2,0)","v":"HD (V: h264; A: mp2@2ch)"},"http://faim.top:12306/rtp/239.77.0.134:5146"]
["239.77.0.20:5146","SD (V: h264; A: mp2@2ch)",null,null,"-","",{"$f":"VLOOKUP(F10,A:B,2,0)","v":{"$error":"#N/A"}},"#EXTINF:-1 tvg-name=\"广东卫视\",广东卫视"]
["239.77.0.21:5146","HD (V: h264; A: mp2@2ch)",null,null,"239.77.0.2:5146","239.77.0.2:5146",{"$f":"VLOOKUP(F11,A:B,2,0)","v":"4K (V: hevc; A: aac@2ch)"},"http://faim.top:12306/rtp/239.77.0.2:5146"]
["239.77.0.22:5146","HD (V: h264; A: mp2@2ch)",null,null,"-","",{"$f":"VLOOKUP(F12,A:B,2,0)","v":{"$error":"#N/A"}},"#EXTINF:-1 tvg-name=\"广东珠江\",广东珠江"]
["239.77.0.25:5146","HD (V: h264; A: mp2@2ch)",null,null,"239.77.0.3:5146","239.77.0.3:5146",{"$f":"VLOOKUP(F13,A:B,2,0)","v":"4K (V: hevc; A: ac3@6ch)"},"http://faim.top:12306/rtp/239.77.0.3:5146"]
["239.77.0.28:5146","SD (V: h264; A: mp2@2ch)",null,null,"-","",{"$f":"VLOOKUP(F14,A:B,2,0)","v":{"$error":"#N/A"}},"#EXTINF:-1 tvg-name=\"广东新闻\",广东新闻"]
["239.77.0.30:5146","SD (V: h264; A: mp2@2ch)",null,null,"-","239.77.0.4:5146",{"$f":"VLOOKUP(F15,A:B,2,0)","v":{"$error":"#N/A"}},"http://faim.top:12306/rtp/239.77.0.4:5146"]
["239.77.0.31:5146","SD (V: h264; A: mp2@2ch)",null,null,"-","",{"$f":"VLOOKUP(F16,A:B,2,0)","v":{"$error":"#N/A"}},"#EXTINF:-1 tvg-name=\"广东民生\",广东民生"]
["239.77.0.32:5146","SD (V: h264; A: mp2@2ch)",null,null,"-","239.77.0.5:5146",{"$f":"VLOOKUP(F17,A:B,2,0)","v":{"$error":"#N/A"}},"http://faim.top:12306/rtp/239.77.0.5:5146"]
["239.77.0.33:5146","SD (V: h264; A: mp2@2ch)",null,null,"-","",{"$f":"VLOOKUP(F18,A:B,2,0)","v":{"$error":"#N/A"}},"#EXTINF:-1 tvg-name=\"广东体育\",广东体育"]
["239.77.0.34:5146","SD (V: h264; A: mp2@2ch)",null,null,"-","239.77.0.6:5146",{"$f":"VLOOKUP(F19,A:B,2,0)","v":{"$error":"#N/A"}},"http://faim.top:12306/rtp/239.77.0.6:5146"]
["239.77.0.35:5146","SD (V: h264; A: mp2@2ch)",null,null,"-","",{"$f":"VLOOKUP(F20,A:B,2,0)","v":{"$error":"#N/A"}},"#EXTINF:-1 tvg-name=\"经济科教\",经济科教"]
["239.77.0.36:5146","SD (V: h264; A: mp2@2ch)",null,null,"-","239.77.0.8:5146",{"$f":"VLOOKUP(F21,A:B,2,0)","v":{"$error":"#N/A"}},"http://faim.top:12306/rtp/239.77.0.8:5146"]
["239.77.0.37:5146","SD (V: h264; A: mp2@2ch)",null,null,"-","",{"$f":"VLOOKUP(F22,A:B,2,0)","v":{"$error":"#N/A"}},"#EXTINF:-1 tvg-name=\"大湾区卫视\",大湾区卫视"]
["239.77.0.38:5146","SD (V: h264; A: mp2@2ch)",null,null,"-","239.77.0.9:5146",{"$f":"VLOOKUP(F23,A:B,2,0)","v":{"$error":"#N/A"}},"http://faim.top:12306/rtp/239.77.0.9:5146"]
["239.77.0.39:5146","SD (V: h264; A: mp2@2ch)",null,null,"-","",{"$f":"VLOOKUP(F24,A:B,2,0)","v":{"$error":"#N/A"}},"#EXTINF:-1 tvg-name=\"广东影视\",广东影视"]
["239.77.0.40:5146","SD (V: h264; A: mp2@2ch)",null,null,"-","239.77.0.11:5146",{"$f":"VLOOKUP(F25,A:B,2,0)","v":{"$error":"#N/A"}},"http://faim.top:12306/rtp/239.77.0.11:5146"]
["239.77.0.41:5146","SD (V: h264; A: mp2@2ch)",null,null,"-","",{"$f":"VLOOKUP(F26,A:B,2,0)","v":{"$error":"#N/A"}},"#EXTINF:-1 tvg-name=\"广东少儿\",广东少儿"]
["239.77.0.42:5146","SD (V: h264; A: mp2@2ch)",null,null,"-","239.77.0.12:5146",{"$f":"VLOOKUP(F27,A:B,2,0)","v":{"$error":"#N/A"}},"http://faim.top:12306/rtp/239.77.0.12:5146"]
["239.77.0.43:5146","SD (V: h264; A: mp2@2ch)",null,null,"-","",{"$f":"VLOOKUP(F28,A:B,2,0)","v":{"$error":"#N/A"}},"#EXTINF:-1 tvg-name=\"嘉佳卡通\",嘉佳卡通"]
["239.77.0.44:5146","SD (V: h264; A: mp2@2ch)",null,null,"-","239.77.0.13:5146",{"$f":"VLOOKUP(F29,A:B,2,0)","v":{"$error":"#N/A"}},"http://faim.top:12306/rtp/239.77.0.13:5146"]
["239.77.0.45:5146","SD (V: h264; A: mp2@2ch)",null,null,"-","",{"$f":"VLOOKUP(F30,A:B,2,0)","v":{"$error":"#N/A"}},"#EXTINF:-1 tvg-name=\"广东4K超高清\",广东4K超高清"]
["239.77.0.68:5146","SD (V: h264; A: mp2@2ch)",null,null,"239.77.0.244:5146","239.77.0.244:5146",{"$f":"VLOOKUP(F31,A:B,2,0)","v":"4K (V: hevc; A: ac3@2ch)"},"http://faim.top:12306/rtp/239.77.0.244:5146"]
["239.77.0.69:5146","SD (V: h264; A: mp2@2ch)",null,null,"-","",{"$f":"VLOOKUP(F32,A:B,2,0)","v":{"$error":"#N/A"}},"#EXTINF:-1 tvg-name=\"广东4K超高清 窄色域 30\",广东4K超高清 窄色域 30"]
["239.77.0.70:5146","SD (V: h264; A: mp2@2ch)",null,null,"239.77.0.245:5146","239.77.0.245:5146",{"$f":"VLOOKUP(F33,A:B,2,0)","v":"4K (V: hevc; A: aac@2ch)"},"http://faim.top:12306/rtp/239.77.0.245:5146"]
["239.77.0.73:5146","SD (V: h264; A: mp2@2ch)",null,null,"-","",{"$f":"VLOOKUP(F34,A:B,2,0)","v":{"$error":"#N/A"}},"#EXTINF:-1 tvg-name=\"南方购物-精选\",南方购物-精选"]
["239.77.0.74:5146","SD (V: h264; A: mp2@2ch)",null,null,"239.77.0.19:5146","239.77.0.19:5146",{"$f":"VLOOKUP(F35,A:B,2,0)","v":"HD (V: h264; A: mp2@2ch)"},"http://faim.top:12306/rtp/239.77.0.19:5146"]
["239.77.0.75:5146","SD (V: h264; A: mp2@2ch)",null,null,"-","",{"$f":"VLOOKUP(F36,A:B,2,0)","v":{"$error":"#N/A"}},"#EXTINF:-1 tvg-name=\"广东4K超高清 宽色域AVS2\",广东4K超高清 宽色域AVS2"]
["239.77.0.77:5146","SD (V: h264; A: mp2@2ch)",null,null,"239.77.0.252:5146","239.77.0.252:5146",{"$f":"VLOOKUP(F37,A:B,2,0)","v":"4K (V: avs2; A: ac3@6ch)"},"http://faim.top:12306/rtp/239.77.0.252:5146"]
["239.77.0.78:5146","HD (V: h264; A: mp2@2ch)",null,null,"-","",{"$f":"VLOOKUP(F38,A:B,2,0)","v":{"$error":"#N/A"}},"#EXTINF:-1 tvg-name=\"广东移动\",广东移动"]
["239.77.0.79:5146","SD (V: h264; A: mp2@2ch)",null,null,"239.77.0.20:5146","239.77.0.20:5146",{"$f":"VLOOKUP(F39,A:B,2,0)","v":"SD (V: h264; A: mp2@2ch)"},"http://faim.top:12306/rtp/239.77.0.20:5146"]
["239.77.0.81:5146","SD (V: h264; A: mp2@1ch)",null,null,"-","",{"$f":"VLOOKUP(F40,A:B,2,0)","v":{"$error":"#N/A"}},"#EXTINF:-1 tvg-name=\"肇庆新闻综合\",肇庆新闻综合"]
["239.77.0.83:5146","SD (V: h264; A: mp2@1ch)",null,null,"239.253.43.1:5146","239.253.43.1:5146",{"$f":"VLOOKUP(F41,A:B,2,0)","v":"HD (V: h264; A: mp2@2ch)"},"http://faim.top:12306/rtp/239.253.43.1:5146"]
["239.77.0.84:5146","HD (V: h264; A: mp2@2ch)",null,null,"-","",{"$f":"VLOOKUP(F42,A:B,2,0)","v":{"$error":"#N/A"}},"#EXTINF:-1 tvg-name=\"肇庆生活服务\",肇庆生活服务"]
["239.77.0.85:5146","HD (V: h264; A: mp2@2ch)",null,null,"239.253.43.2:5146","239.253.43.2:5146",{"$f":"VLOOKUP(F43,A:B,2,0)","v":"HD (V: h264; A: mp2@2ch)"},"http://faim.top:12306/rtp/239.253.43.2:5146"]
["239.77.0.86:5146","HD (V: h264; A: mp2@2ch)",null,null,"-","",{"$f":"VLOOKUP(F44,A:B,2,0)","v":{"$error":"#N/A"}},"#EXTINF:-1 tvg-name=\"南方购物\",南方购物"]
["239.77.0.87:5146","HD (V: h264; A: mp2@2ch)",null,null,"239.77.0.22:5146","239.77.0.22:5146",{"$f":"VLOOKUP(F45,A:B,2,0)","v":"HD (V: h264; A: mp2@2ch)"},"http://faim.top:12306/rtp/239.77.0.22:5146"]
["239.77.0.88:5146","HD (V: h264; A: mp2@2ch)",null,null,"-","",{"$f":"VLOOKUP(F46,A:B,2,0)","v":{"$error":"#N/A"}},"#EXTINF:-1 tvg-name=\"岭南戏曲\",岭南戏曲"]
["239.77.0.89:5146","HD (V: h264; A: mp2@2ch)",null,null,"-","239.77.0.16:5146",{"$f":"VLOOKUP(F47,A:B,2,0)","v":{"$error":"#N/A"}},"http://faim.top:12306/rtp/239.77.0.16:5146"]
["239.77.0.90:5146","HD (V: h264; A: mp2@2ch)",null,null,"-","",{"$f":"VLOOKUP(F48,A:B,2,0)","v":{"$error":"#N/A"}},"#EXTINF:-1 tvg-name=\"现代教育\",现代教育"]
["239.77.0.91:5146","HD (V: h264; A: mp2@2ch)",null,null,"-","239.77.0.18:5146",{"$f":"VLOOKUP(F49,A:B,2,0)","v":{"$error":"#N/A"}},"http://faim.top:12306/rtp/239.77.0.18:5146"]
["239.77.0.92:5146","HD (V: h264; A: mp2@2ch)",null,null,"-","",{"$f":"VLOOKUP(F50,A:B,2,0)","v":{"$error":"#N/A"}},"#EXTINF:-1 tvg-name=\"CCTV-1综合\",CCTV-1综合"]
["239.77.0.93:5146","HD (V: h264; A: mp2@2ch)",null,null,"239.77.0.30:5146","239.77.0.30:5146",{"$f":"VLOOKUP(F51,A:B,2,0)","v":"SD (V: h264; A: mp2@2ch)"},"http://faim.top:12306/rtp/239.77.0.30:5146"]
["239.77.0.94:5146","HD (V: h264; A: mp2@2ch)",null,null,"-","",{"$f":"VLOOKUP(F52,A:B,2,0)","v":{"$error":"#N/A"}},"#EXTINF:-1 tvg-name=\"CCTV-2财经\",CCTV-2财经"]
["239.77.0.95:5146","HD (V: h264; A: mp2@2ch)",null,null,"239.77.0.31:5146","239.77.0.31:5146",{"$f":"VLOOKUP(F53,A:B,2,0)","v":"SD (V: h264; A: mp2@2ch)"},"http://faim.top:12306/rtp/239.77.0.31:5146"]
["239.77.0.96:5146","SD (V: h264; A: mp2@2ch)",null,null,"-","",{"$f":"VLOOKUP(F54,A:B,2,0)","v":{"$error":"#N/A"}},"#EXTINF:-1 tvg-name=\"CCTV-3综艺\",CCTV-3综艺"]
["239.77.0.97:5146","HD (V: h264; A: mp2@2ch)",null,null,"-","239.0.10.52:5052",{"$f":"VLOOKUP(F55,A:B,2,0)","v":{"$error":"#N/A"}},"http://faim.top:12306/rtp/239.0.10.52:5052"]
["239.77.0.98:5146","HD (V: h264; A: mp2@2ch)",null,null,"-","",{"$f":"VLOOKUP(F56,A:B,2,0)","v":{"$error":"#N/A"}},"#EXTINF:-1 tvg-name=\"CCTV-4中文国际\",CCTV-4中文国际"]
["239.77.0.99:5146","HD (V: h264; A: mp2@2ch)",null,null,"239.77.0.33:5146","239.77.0.33:5146",{"$f":"VLOOKUP(F57,A:B,2,0)","v":"SD (V: h264; A: mp2@2ch)"},"http://faim.top:12306/rtp/239.77.0.33:5146"]
["239.77.0.100:5146","HD (V: h264; A: mp2@2ch)",null,null,"-","",{"$f":"VLOOKUP(F58,A:B,2,0)","v":{"$error":"#N/A"}},"#EXTINF:-1 tvg-name=\"CCTV-5体育\",CCTV-5体育"]
["239.77.0.101:5146","HD (V: h264; A: mp2@2ch)",null,null,"239.77.0.34:5146","239.77.0.34:5146",{"$f":"VLOOKUP(F59,A:B,2,0)","v":"SD (V: h264; A: mp2@2ch)"},"http://faim.top:12306/rtp/239.77.0.34:5146"]
["239.77.0.102:5146","HD (V: h264; A: mp2@2ch)",null,null,"-","",{"$f":"VLOOKUP(F60,A:B,2,0)","v":{"$error":"#N/A"}},"#EXTINF:-1 tvg-name=\"CCTV-6电影\",CCTV-6电影"]
["239.77.0.103:5146","HD (V: h264; A: mp2@2ch)",null,null,"-","239.0.10.54:5054",{"$f":"VLOOKUP(F61,A:B,2,0)","v":{"$error":"#N/A"}},"http://faim.top:12306/rtp/239.0.10.54:5054"]
["239.77.0.104:5146","HD (V: h264; A: mp2@2ch)",null,null,"-","",{"$f":"VLOOKUP(F62,A:B,2,0)","v":{"$error":"#N/A"}},"#EXTINF:-1 tvg-name=\"CCTV-7国防军事\",CCTV-7国防军事"]
["239.77.0.105:5146","HD (V: h264; A: mp2@2ch)",null,null,"239.77.0.36:5146","239.77.0.36:5146",{"$f":"VLOOKUP(F63,A:B,2,0)","v":"SD (V: h264; A: mp2@2ch)"},"http://faim.top:12306/rtp/239.77.0.36:5146"]
["239.77.0.106:5146","HD (V: h264; A: mp2@2ch)",null,null,"-","",{"$f":"VLOOKUP(F64,A:B,2,0)","v":{"$error":"#N/A"}},"#EXTINF:-1 tvg-name=\"CCTV-8电视剧\",CCTV-8电视剧"]
["239.77.0.107:5146","HD (V: h264; A: mp2@2ch)",null,null,"-","239.0.10.55:5055",{"$f":"VLOOKUP(F65,A:B,2,0)","v":{"$error":"#N/A"}},"http://faim.top:12306/rtp/239.0.10.55:5055"]
["239.77.0.108:5146","HD (V: h264; A: mp2@2ch)",null,null,"-","",{"$f":"VLOOKUP(F66,A:B,2,0)","v":{"$error":"#N/A"}},"#EXTINF:-1 tvg-name=\"CCTV-9纪录\",CCTV-9纪录"]
["239.77.0.109:5146","HD (V: h264; A: mp2@2ch)",null,null,{"$f":"IFERROR(VLOOKUP(F67,A:A,1,0),\"-\")","v":"239.77.0.38:5146"},{"$f":"IF(LEFT(H67,1)=\"#\",\"\",MID(H67,FIND(\"rtp\",H67)+4,LEN(H67)-FIND(\"rtp\",H67)-3))","v":"239.77.0.38:5146"},{"$f":"VLOOKUP(F67,A:B,2,0)","v":"SD (V: h264; A: mp2@2ch)"},"http://faim.top:12306/rtp/239.77.0.38:5146"]
["239.77.0.110:5146","HD (V: h264; A: mp2@2ch)",null,null,"-","",{"$f":"VLOOKUP(F68,A:B,2,0)","v":{"$error":"#N/A"}},"#EXTINF:-1 tvg-name=\"CCTV-10科教\",CCTV-10科教"]
["239.77.0.111:5146","HD (V: h264; A: mp2@2ch)",null,null,"239.77.0.39:5146","239.77.0.39:5146",{"$f":"VLOOKUP(F69,A:B,2,0)","v":"SD (V: h264; A: mp2@2ch)"},"http://faim.top:12306/rtp/239.77.0.39:5146"]
["239.77.0.112:5146","HD (V: h264; A: mp2@2ch)",null,null,"-","",{"$f":"VLOOKUP(F70,A:B,2,0)","v":{"$error":"#N/A"}},"#EXTINF:-1 tvg-name=\"CCTV-11戏曲\",CCTV-11戏曲"]
["239.77.0.113:5146","SD (V: h264; A: mp2@2ch)",null,null,"239.77.0.40:5146","239.77.0.40:5146",{"$f":"VLOOKUP(F71,A:B,2,0)","v":"SD (V: h264; A: mp2@2ch)"},"http://faim.top:12306/rtp/239.77.0.40:5146"]
["239.77.0.114:5146","HD (V: h264; A: mp2@2ch)",null,null,"-","",{"$f":"VLOOKUP(F72,A:B,2,0)","v":{"$error":"#N/A"}},"#EXTINF:-1 tvg-name=\"CCTV-12社会与法\",CCTV-12社会与法"]
["239.77.0.115:5146","SD (V: h264; A: mp2@2ch)",null,null,"239.77.0.41:5146","239.77.0.41:5146",{"$f":"VLOOKUP(F73,A:B,2,0)","v":"SD (V: h264; A: mp2@2ch)"},"http://faim.top:12306/rtp/239.77.0.41:5146"]
["239.77.0.117:5146","HD (V: h264; A: mp2@2ch)",null,null,"-","",{"$f":"VLOOKUP(F74,A:B,2,0)","v":{"$error":"#N/A"}},"#EXTINF:-1 tvg-name=\"CCTV-13新闻\",CCTV-13新闻"]
["239.77.0.119:5146","HD (V: h264; A: mp2@2ch)",null,null,"239.77.0.42:5146","239.77.0.42:5146",{"$f":"VLOOKUP(F75,A:B,2,0)","v":"SD (V: h264; A: mp2@2ch)"},"http://faim.top:12306/rtp/239.77.0.42:5146"]
["239.77.0.122:5146","HD (V: h264; A: mp2@2ch)",null,null,"-","",{"$f":"VLOOKUP(F76,A:B,2,0)","v":{"$error":"#N/A"}},"#EXTINF:-1 tvg-name=\"CCTV-14少儿\",CCTV-14少儿"]
["239.77.0.123:5146","HD (V: h264; A: mp2@2ch)",null,null,"239.77.0.43:5146","239.77.0.43:5146",{"$f":"VLOOKUP(F77,A:B,2,0)","v":"SD (V: h264; A: mp2@2ch)"},"http://faim.top:12306/rtp/239.77.0.43:5146"]
["239.77.0.124:5146","HD (V: mpeg2video; A: ac3@2ch, mp2@2ch)",null,null,"-","",{"$f":"VLOOKUP(F78,A:B,2,0)","v":{"$error":"#N/A"}},"#EXTINF:-1 tvg-name=\"CCTV-15音乐\",CCTV-15音乐"]
["239.77.0.125:5146","HD (V: cavs; A: ac3@6ch)",null,null,"239.77.0.44:5146","239.77.0.44:5146",{"$f":"VLOOKUP(F79,A:B,2,0)","v":"SD (V: h264; A: mp2@2ch)"},"http://faim.top:12306/rtp/239.77.0.44:5146"]
["239.77.0.126:5146","HD (V: cavs; A: ac3@6ch)",null,null,"-","",{"$f":"VLOOKUP(F80,A:B,2,0)","v":{"$error":"#N/A"}},"#EXTINF:-1 tvg-name=\"CGTN\",CGTN"]
["239.77.0.127:5146","HD (V: cavs; A: eac3@6ch, ac3@6ch)",null,null,"239.77.0.45:5146","239.77.0.45:5146",{"$f":"VLOOKUP(F81,A:B,2,0)","v":"SD (V: h264; A: mp2@2ch)"},"http://faim.top:12306/rtp/239.77.0.45:5146"]
["239.77.0.128:5146","HD (V: mpeg2video; A: ac3@2ch)",null,null,"-","",{"$f":"VLOOKUP(F82,A:B,2,0)","v":{"$error":"#N/A"}},"#EXTINF:-1 tvg-name=\"CCTV-17农业\",CCTV-17农业"]
["239.77.0.129:5146","HD (V: h264; A: mp2@2ch)",null,null,"239.77.0.115:5146","239.77.0.115:5146",{"$f":"VLOOKUP(F83,A:B,2,0)","v":"SD (V: h264; A: mp2@2ch)"},"http://faim.top:12306/rtp/239.77.0.115:5146"]
["239.77.0.130:5146","HD (V: mpeg2video; A: ac3@2ch)",null,null,"-","",{"$f":"VLOOKUP(F84,A:B,2,0)","v":{"$error":"#N/A"}},"#EXTINF:-1 tvg-name=\"CCTV4K-25P\",CCTV4K-25P"]
["239.77.0.131:5146","HD (V: mpeg2video; A: ac3@2ch)",null,null,"239.77.0.194:5146","239.77.0.194:5146",{"$f":"VLOOKUP(F85,A:B,2,0)","v":"4K (V: hevc; A: aac@2ch)"},"http://faim.top:12306/rtp/239.77.0.194:5146"]
["239.77.0.132:5146","HD (V: cavs; A: mp2@2ch, ac3@6ch)",null,null,"-","",{"$f":"VLOOKUP(F86,A:B,2,0)","v":{"$error":"#N/A"}},"#EXTINF:-1 tvg-name=\"CCTV4K-50P\",CCTV4K-50P"]
["239.77.0.133:5146","HD (V: h264; A: mp2@2ch)",null,null,"239.77.0.174:5146","239.77.0.174:5146",{"$f":"VLOOKUP(F87,A:B,2,0)","v":"4K (V: hevc; A: aac@2ch)"},"http://faim.top:12306/rtp/239.77.0.174:5146"]
["239.77.0.134:5146","HD (V: h264; A: mp2@2ch)",null,null,"-","",{"$f":"VLOOKUP(F88,A:B,2,0)","v":{"$error":"#N/A"}},"#EXTINF:-1 tvg-name=\"湖南卫视\",湖南卫视"]
["239.77.0.135:5146","HD (V: h264; A: mp2@2ch)",null,null,"239.77.0.88:5146","239.77.0.88:5146",{"$f":"VLOOKUP(F89,A:B,2,0)","v":"HD (V: h264; A: mp2@2ch)"},"http://faim.top:12306/rtp/239.77.0.88:5146"]
["239.77.0.136:5146","HD (V: h264; A: mp2@2ch)",null,null,"-","",{"$f":"VLOOKUP(F90,A:B,2,0)","v":{"$error":"#N/A"}},"#EXTINF:-1 tvg-name=\"浙江卫视\",浙江卫视"]
["239.77.0.137:5146","HD (V: h264; A: mp2@2ch)",null,null,"239.77.0.89:5146","239.77.0.89:5146",{"$f":"VLOOKUP(F91,A:B,2,0)","v":"HD (V: h264; A: mp2@2ch)"},"http://faim.top:12306/rtp/239.77.0.89:5146"]
["239.77.0.138:5146","HD (V: h264; A: mp2@2ch)",null,null,"-","",{"$f":"VLOOKUP(F92,A:B,2,0)","v":{"$error":"#N/A"}},"#EXTINF:-1 tvg-name=\"江苏卫视\",江苏卫视"]
["239.77.0.139:5146","HD (V: h264; A: mp2@2ch)",null,null,"239.77.0.90:5146","239.77.0.90:5146",{"$f":"VLOOKUP(F93,A:B,2,0)","v":"HD (V: h264; A: mp2@2ch)"},"http://faim.top:12306/rtp/239.77.0.90:5146"]
["239.77.0.140:5146","HD (V: h264; A: mp2@2ch)",null,null,"-","",{"$f":"VLOOKUP(F94,A:B,2,0)","v":{"$error":"#N/A"}},"#EXTINF:-1 tvg-name=\"东方卫视\",东方卫视"]
["239.77.0.141:5146","HD (V: h264; A: mp2@2ch)",null,null,"239.77.0.98:5146","239.77.0.98:5146",{"$f":"VLOOKUP(F95,A:B,2,0)","v":"HD (V: h264; A: mp2@2ch)"},"http://faim.top:12306/rtp/239.77.0.98:5146"]
["239.77.0.145:5146","HD (V: h264; A: mp2@2ch)",null,null,"-","",{"$f":"VLOOKUP(F96,A:B,2,0)","v":{"$error":"#N/A"}},"#EXTINF:-1 tvg-name=\"安徽卫视\",安徽卫视"]
["239.77.0.146:5146","HD (V: h264; A: mp2@2ch)",null,null,"239.77.0.183:5146","239.77.0.183:5146",{"$f":"VLOOKUP(F97,A:B,2,0)","v":"HD (V: h264; A: mp2@2ch)"},"http://faim.top:12306/rtp/239.77.0.183:5146"]
["239.77.0.148:5146","HD (V: h264; A: mp2@2ch)",null,null,"-","",{"$f":"VLOOKUP(F98,A:B,2,0)","v":{"$error":"#N/A"}},"#EXTINF:-1 tvg-name=\"北京卫视\",北京卫视"]
["239.77.0.149:5146","HD (V: h264; A: mp2@2ch)",null,null,"239.77.0.91:5146","239.77.0.91:5146",{"$f":"VLOOKUP(F99,A:B,2,0)","v":"HD (V: h264; A: mp2@2ch)"},"http://faim.top:12306/rtp/239.77.0.91:5146"]
["239.77.0.150:5146","HD (V: h264; A: mp2@2ch)",null,null,"-","",{"$f":"VLOOKUP(F100,A:B,2,0)","v":{"$error":"#N/A"}},"#EXTINF:-1 tvg-name=\"天津卫视\",天津卫视"]
["239.77.0.153:5146","SD (V: h264; A: mp2@2ch)",null,null,"239.77.0.97:5146","239.77.0.97:5146",{"$f":"VLOOKUP(F101,A:B,2,0)","v":"HD (V: h264; A: mp2@2ch)"},"http://faim.top:12306/rtp/239.77.0.97:5146"]
["239.77.0.155:5146","HD (V: h264; A: mp2@2ch)",null,null,"-","",{"$f":"VLOOKUP(F102,A:B,2,0)","v":{"$error":"#N/A"}},"#EXTINF:-1 tvg-name=\"山东卫视\",山东卫视"]
["239.77.0.159:5146","HD (V: h264; A: mp2@2ch)",null,null,"239.77.0.94:5146","239.77.0.94:5146",{"$f":"VLOOKUP(F103,A:B,2,0)","v":"HD (V: h264; A: mp2@2ch)"},"http://faim.top:12306/rtp/239.77.0.94:5146"]
["239.77.0.160:5146","HD (V: h264; A: mp2@2ch)",null,null,"-","",{"$f":"VLOOKUP(F104,A:B,2,0)","v":{"$error":"#N/A"}},"#EXTINF:-1 tvg-name=\"江西卫视\",江西卫视"]
["239.77.0.161:5146","HD (V: cavs; A: ac3@6ch)",null,null,"239.77.0.149:5146","239.77.0.149:5146",{"$f":"VLOOKUP(F105,A:B,2,0)","v":"HD (V: h264; A: mp2@2ch)"},"http://faim.top:12306/rtp/239.77.0.149:5146"]
["239.77.0.162:5146","HD (V: cavs; A: ac3@6ch)",null,null,"-","",{"$f":"VLOOKUP(F106,A:B,2,0)","v":{"$error":"#N/A"}},"#EXTINF:-1 tvg-name=\"深圳卫视\",深圳卫视"]
["239.77.0.163:5146","HD (V: cavs; A: ac3@6ch)",null,null,"239.77.0.92:5146","239.77.0.92:5146",{"$f":"VLOOKUP(F107,A:B,2,0)","v":"HD (V: h264; A: mp2@2ch)"},"http://faim.top:12306/rtp/239.77.0.92:5146"]
["239.77.0.164:5146","HD (V: h264; A: mp2@2ch)",null,null,"-","",{"$f":"VLOOKUP(F108,A:B,2,0)","v":{"$error":"#N/A"}},"#EXTINF:-1 tvg-name=\"湖北卫视\",湖北卫视"]
["239.77.0.165:5146","HD (V: h264; A: mp2@2ch)",null,null,"239.77.0.95:5146","239.77.0.95:5146",{"$f":"VLOOKUP(F109,A:B,2,0)","v":"HD (V: h264; A: mp2@2ch)"},"http://faim.top:12306/rtp/239.77.0.95:5146"]
["239.77.0.166:5146","HD (V: h264; A: mp2@2ch)",null,null,"-","",{"$f":"VLOOKUP(F110,A:B,2,0)","v":{"$error":"#N/A"}},"#EXTINF:-1 tvg-name=\"辽宁卫视\",辽宁卫视"]
["239.77.0.167:5146","HD (V: h264; A: mp2@2ch)",null,null,"239.77.0.123:5146","239.77.0.123:5146",{"$f":"VLOOKUP(F111,A:B,2,0)","v":"HD (V: h264; A: mp2@2ch)"},"http://faim.top:12306/rtp/239.77.0.123:5146"]
["239.77.0.168:5146","HD (V: h264; A: mp2@2ch)",null,null,"-","",{"$f":"VLOOKUP(F112,A:B,2,0)","v":{"$error":"#N/A"}},"#EXTINF:-1 tvg-name=\"黑龙江卫视\",黑龙江卫视"]
["239.77.0.169:5146","HD (V: h264; A: mp2@2ch)",null,null,"239.77.0.93:5146","239.77.0.93:5146",{"$f":"VLOOKUP(F113,A:B,2,0)","v":"HD (V: h264; A: mp2@2ch)"},"http://faim.top:12306/rtp/239.77.0.93:5146"]
["239.77.0.170:5146","HD (V: h264; A: mp2@2ch)",null,null,"-","",{"$f":"VLOOKUP(F114,A:B,2,0)","v":{"$error":"#N/A"}},"#EXTINF:-1 tvg-name=\"贵州卫视\",贵州卫视"]
["239.77.0.171:5146","HD (V: h264; A: mp2@2ch)",null,null,"239.77.0.230:5146","239.77.0.230:5146",{"$f":"VLOOKUP(F115,A:B,2,0)","v":"HD (V: h264; A: mp2@2ch)"},"http://faim.top:12306/rtp/239.77.0.230:5146"]
["239.77.0.172:5146","HD (V: h264; A: mp2@2ch)",null,null,"-","",{"$f":"VLOOKUP(F116,A:B,2,0)","v":{"$error":"#N/A"}},"#EXTINF:-1 tvg-name=\"四川卫视\",四川卫视"]
["239.77.0.173:5146","HD (V: h264; A: mp2@2ch)",null,null,"239.77.0.159:5146","239.77.0.159:5146",{"$f":"VLOOKUP(F117,A:B,2,0)","v":"HD (V: h264; A: mp2@2ch)"},"http://faim.top:12306/rtp/239.77.0.159:5146"]
["239.77.0.174:5146","4K (V: hevc; A: aac@2ch)",null,null,"-","",{"$f":"VLOOKUP(F118,A:B,2,0)","v":{"$error":"#N/A"}},"#EXTINF:-1 tvg-name=\"河南卫视\",河南卫视"]
["239.77.0.175:5146","HD (V: cavs; A: ac3@6ch)",null,null,"239.77.0.17:5146","239.77.0.17:5146",{"$f":"VLOOKUP(F119,A:B,2,0)","v":"HD (V: h264; A: mp2@2ch)"},"http://faim.top:12306/rtp/239.77.0.17:5146"]
["239.77.0.176:5146","HD (V: h264; A: mp2@2ch)",null,null,"-","",{"$f":"VLOOKUP(F120,A:B,2,0)","v":{"$error":"#N/A"}},"#EXTINF:-1 tvg-name=\"云南卫视\",云南卫视"]
["239.77.0.177:5146","HD (V: cavs; A: ac3@6ch)",null,null,"239.253.43.100:5146","239.253.43.100:5146",{"$f":"VLOOKUP(F121,A:B,2,0)","v":"HD (V: h264; A: mp2@2ch)"},"http://faim.top:12306/rtp/239.253.43.100:5146"]
["239.77.0.178:5146","HD (V: cavs; A: ac3@2ch)",null,null,"-","",{"$f":"VLOOKUP(F122,A:B,2,0)","v":{"$error":"#N/A"}},"#EXTINF:-1 tvg-name=\"重庆卫视\",重庆卫视"]
["239.77.0.179:5146","HD (V: h264; A: mp2@2ch)",null,null,"239.77.0.182:5146","239.77.0.182:5146",{"$f":"VLOOKUP(F123,A:B,2,0)","v":"HD (V: h264; A: mp2@2ch)"},"http://faim.top:12306/rtp/239.77.0.182:5146"]
["239.77.0.180:5146","HD (V: h264; A: mp2@2ch)",null,null,"-","",{"$f":"VLOOKUP(F124,A:B,2,0)","v":{"$error":"#N/A"}},"#EXTINF:-1 tvg-name=\"河北卫视\",河北卫视"]
["239.77.0.181:5146","HD (V: cavs; A: ac3@6ch)",null,null,"239.77.0.148:5146","239.77.0.148:5146",{"$f":"VLOOKUP(F125,A:B,2,0)","v":"HD (V: h264; A: mp2@2ch)"},"http://faim.top:12306/rtp/239.77.0.148:5146"]
["239.77.0.182:5146","HD (V: h264; A: mp2@2ch)",null,null,"-","",{"$f":"VLOOKUP(F126,A:B,2,0)","v":{"$error":"#N/A"}},"#EXTINF:-1 tvg-name=\"东南卫视\",东南卫视"]
["239.77.0.183:5146","HD (V: h264; A: mp2@2ch)",null,null,"239.77.0.146:5146","239.77.0.146:5146",{"$f":"VLOOKUP(F127,A:B,2,0)","v":"HD (V: h264; A: mp2@2ch)"},"http://faim.top:12306/rtp/239.77.0.146:5146"]
["239.77.0.185:5146","HD (V: h264; A: mp2@2ch)",null,null,"-","",{"$f":"VLOOKUP(F128,A:B,2,0)","v":{"$error":"#N/A"}},"#EXTINF:-1 tvg-name=\"广西卫视\",广西卫视"]
["239.77.0.186:5146","SD (V: h264; A: mp2@2ch)",null,null,"239.77.0.139:5146","239.77.0.139:5146",{"$f":"VLOOKUP(F129,A:B,2,0)","v":"HD (V: h264; A: mp2@2ch)"},"http://faim.top:12306/rtp/239.77.0.139:5146"]
["239.77.0.187:5146","HD (V: h264; A: mp2@2ch)",null,null,"-","",{"$f":"VLOOKUP(F130,A:B,2,0)","v":{"$error":"#N/A"}},"#EXTINF:-1 tvg-name=\"吉林卫视\",吉林卫视"]
["239.77.0.188:5146","HD (V: h264; A: mp2@2ch)",null,null,{"$f":"IFERROR(VLOOKUP(F131,A:A,1,0),\"-\")","v":"239.77.0.150:5146"},{"$f":"IF(LEFT(H131,1)=\"#\",\"\",MID(H131,FIND(\"rtp\",H131)+4,LEN(H131)-FIND(\"rtp\",H131)-3))","v":"239.77.0.150:5146"},{"$f":"VLOOKUP(F131,A:B,2,0)","v":"HD (V: h264; A: mp2@2ch)"},"http://faim.top:12306/rtp/239.77.0.150:5146"]
["239.77.0.189:5146","HD (V: h264; A: mp2@2ch)",null,null,"-","",{"$f":"VLOOKUP(F132,A:B,2,0)","v":{"$error":"#N/A"}},"#EXTINF:-1 tvg-name=\"陕西卫视\",陕西卫视"]
["239.77.0.190:5146","SD (V: h264; A: mp2@2ch)",null,null,"239.77.0.68:5146","239.77.0.68:5146",{"$f":"VLOOKUP(F133,A:B,2,0)","v":"SD (V: h264; A: mp2@2ch)"},"http://faim.top:12306/rtp/239.77.0.68:5146"]
["239.77.0.191:5146","SD (V: h264; A: mp2@2ch)",null,null,"-","",{"$f":"VLOOKUP(F134,A:B,2,0)","v":{"$error":"#N/A"}},"#EXTINF:-1 tvg-name=\"山西卫视\",山西卫视"]
["239.77.0.193:5146","SD (V: h264; A: mp2@2ch)",null,null,"239.77.0.69:5146","239.77.0.69:5146",{"$f":"VLOOKUP(F135,A:B,2,0)","v":"SD (V: h264; A: mp2@2ch)"},"http://faim.top:12306/rtp/239.77.0.69:5146"]
["239.77.0.194:5146","4K (V: hevc; A: aac@2ch)",null,null,"-","",{"$f":"VLOOKUP(F136,A:B,2,0)","v":{"$error":"#N/A"}},"#EXTINF:-1 tvg-name=\"内蒙古卫视\",内蒙古卫视"]
["239.77.0.198:5146","HD (V: h264; A: mp2@2ch)",null,null,"239.77.0.70:5146","239.77.0.70:5146",{"$f":"VLOOKUP(F137,A:B,2,0)","v":"SD (V: h264; A: mp2@2ch)"},"http://faim.top:12306/rtp/239.77.0.70:5146"]
["239.77.0.199:5146","HD (V: h264; A: mp2@2ch)",null,null,"-","",{"$f":"VLOOKUP(F138,A:B,2,0)","v":{"$error":"#N/A"}},"#EXTINF:-1 tvg-name=\"青海卫视\",青海卫视"]
["239.77.0.200:5146","HD (V: h264; A: mp2@2ch)",null,null,"-","239.77.0.71:5146",{"$f":"VLOOKUP(F139,A:B,2,0)","v":{"$error":"#N/A"}},"http://faim.top:12306/rtp/239.77.0.71:5146"]
["239.77.0.201:5146","HD (V: h264; A: mp2@2ch)",null,null,"-","",{"$f":"VLOOKUP(F140,A:B,2,0)","v":{"$error":"#N/A"}},"#EXTINF:-1 tvg-name=\"海南卫视\",海南卫视"]
["239.77.0.202:5146","HD (V: h264; A: mp2@2ch)",null,null,"239.253.43.101:5146","239.253.43.101:5146",{"$f":"VLOOKUP(F141,A:B,2,0)","v":"HD (V: h264; A: mp2@2ch)"},"http://faim.top:12306/rtp/239.253.43.101:5146"]
["239.77.0.206:5146","HD (V: h264; A: mp2@2ch)",null,null,"-","",{"$f":"VLOOKUP(F142,A:B,2,0)","v":{"$error":"#N/A"}},"#EXTINF:-1 tvg-name=\"宁夏卫视\",宁夏卫视"]
["239.77.0.207:5146","HD (V: h264; A: mp2@2ch)",null,null,"239.77.0.73:5146","239.77.0.73:5146",{"$f":"VLOOKUP(F143,A:B,2,0)","v":"SD (V: h264; A: mp2@2ch)"},"http://faim.top:12306/rtp/239.77.0.73:5146"]
["239.77.0.209:5146","SD (V: h264; A: mp2@1ch)",null,null,"-","",{"$f":"VLOOKUP(F144,A:B,2,0)","v":{"$error":"#N/A"}},"#EXTINF:-1 tvg-name=\"西藏卫视\",西藏卫视"]
["239.77.0.212:5146","HD (V: h264; A: mp2@2ch)",null,null,"239.77.0.74:5146","239.77.0.74:5146",{"$f":"VLOOKUP(F145,A:B,2,0)","v":"SD (V: h264; A: mp2@2ch)"},"http://faim.top:12306/rtp/239.77.0.74:5146"]
["239.77.0.213:5146","HD (V: h264; A: mp2@2ch)",null,null,"-","",{"$f":"VLOOKUP(F146,A:B,2,0)","v":{"$error":"#N/A"}},"#EXTINF:-1 tvg-name=\"新疆卫视\",新疆卫视"]
["239.77.0.215:5146","HD (V: h264; A: mp2@2ch)",null,null,"239.77.0.75:5146","239.77.0.75:5146",{"$f":"VLOOKUP(F147,A:B,2,0)","v":"SD (V: h264; A: mp2@2ch)"},"http://faim.top:12306/rtp/239.77.0.75:5146"]
["239.77.0.217:5146","HD (V: h264; A: mp2@2ch)",null,null,"-","",{"$f":"VLOOKUP(F148,A:B,2,0)","v":{"$error":"#N/A"}},"#EXTINF:-1 tvg-name=\"甘肃卫视\",甘肃卫视"]
["239.77.0.220:5146","SD (V: h264; A: mp2@1ch)",null,null,"239.77.0.189:5146","239.77.0.189:5146",{"$f":"VLOOKUP(F149,A:B,2,0)","v":"HD (V: h264; A: mp2@2ch)"},"http://faim.top:12306/rtp/239.77.0.189:5146"]
["239.77.0.221:5146","HD (V: h264; A: mp2@2ch)",null,null,"-","",{"$f":"VLOOKUP(F150,A:B,2,0)","v":{"$error":"#N/A"}},"#EXTINF:-1 tvg-name=\"兵团卫视\",兵团卫视"]
["239.77.0.222:5146","SD (V: h264; A: mp2@1ch)",null,null,"239.77.0.77:5146","239.77.0.77:5146",{"$f":"VLOOKUP(F151,A:B,2,0)","v":"SD (V: h264; A: mp2@2ch)"},"http://faim.top:12306/rtp/239.77.0.77:5146"]
["239.77.0.225:5146","HD (V: h264; A: mp2@2ch)",null,null,"-","",{"$f":"VLOOKUP(F152,A:B,2,0)","v":{"$error":"#N/A"}},"#EXTINF:-1 tvg-name=\"卡酷动画\",卡酷动画"]
["239.77.0.226:5146","SD (V: h264; A: mp2@1ch)",null,null,"239.77.0.79:5146","239.77.0.79:5146",{"$f":"VLOOKUP(F153,A:B,2,0)","v":"SD (V: h264; A: mp2@2ch)"},"http://faim.top:12306/rtp/239.77.0.79:5146"]
["239.77.0.228:5146","HD (V: h264; A: mp2@2ch)",null,null,"-","",{"$f":"VLOOKUP(F154,A:B,2,0)","v":{"$error":"#N/A"}},"#EXTINF:-1 tvg-name=\"金鹰卡通\",金鹰卡通"]
["239.77.0.229:5146","HD (V: h264; A: mp2@2ch)",null,null,"-","239.77.0.80:5146",{"$f":"VLOOKUP(F155,A:B,2,0)","v":{"$error":"#N/A"}},"http://faim.top:12306/rtp/239.77.0.80:5146"]
["239.77.0.230:5146","HD (V: h264; A: mp2@2ch)",null,null,"-","",{"$f":"VLOOKUP(F156,A:B,2,0)","v":{"$error":"#N/A"}},"#EXTINF:-1 tvg-name=\"炫动卡通\",炫动卡通"]
["239.77.0.232:5146","SD (V: h264; A: mp2@2ch)",null,null,"239.77.0.81:5146","239.77.0.81:5146",{"$f":"VLOOKUP(F157,A:B,2,0)","v":"SD (V: h264; A: mp2@1ch)"},"http://faim.top:12306/rtp/239.77.0.81:5146"]
["239.77.0.233:5146","SD (V: h264; A: mp2@2ch)",null,null,"-","",{"$f":"VLOOKUP(F158,A:B,2,0)","v":{"$error":"#N/A"}},"#EXTINF:-1 tvg-name=\"CETV-1\",CETV-1"]
["239.77.0.236:5146","SD (V: h264; A: mp2@2ch)",null,null,"239.77.0.200:5146","239.77.0.200:5146",{"$f":"VLOOKUP(F159,A:B,2,0)","v":"HD (V: h264; A: mp2@2ch)"},"http://faim.top:12306/rtp/239.77.0.200:5146"]
["239.77.0.240:5146","SD (V: h264; A: mp2@2ch)",null,null,"-","",{"$f":"VLOOKUP(F160,A:B,2,0)","v":{"$error":"#N/A"}},"#EXTINF:-1 tvg-name=\"山东教育\",山东教育"]
["239.77.0.241:5146","SD (V: h264; A: mp2@2ch)",null,null,"239.77.0.83:5146","239.77.0.83:5146",{"$f":"VLOOKUP(F161,A:B,2,0)","v":"SD (V: h264; A: mp2@1ch)"},"http://faim.top:12306/rtp/239.77.0.83:5146"]
["239.77.0.244:5146","4K (V: hevc; A: ac3@2ch)",null,null,"-","",{"$f":"VLOOKUP(F162,A:B,2,0)","v":{"$error":"#N/A"}},"#EXTINF:-1 tvg-name=\"财富天下\",财富天下"]
["239.77.0.245:5146","4K (V: hevc; A: aac@2ch)",null,null,"239.77.0.113:5146","239.77.0.113:5146",{"$f":"VLOOKUP(F163,A:B,2,0)","v":"SD (V: h264; A: mp2@2ch)"},"http://faim.top:12306/rtp/239.77.0.113:5146"]
["239.77.0.250:5146","HD (V: h264; A: mp2@2ch)",null,null,"-","",{"$f":"VLOOKUP(F164,A:B,2,0)","v":{"$error":"#N/A"}},"#EXTINF:-1 tvg-name=\"厦门卫视\",厦门卫视"]
["239.77.0.251:5146","HD (V: h264; A: mp2@2ch)",null,null,"239.77.0.96:5146","239.77.0.96:5146",{"$f":"VLOOKUP(F165,A:B,2,0)","v":"SD (V: h264; A: mp2@2ch)"},"http://faim.top:12306/rtp/239.77.0.96:5146"]
["239.77.0.252:5146","4K (V: avs2; A: ac3@6ch)",null,null,"-","",{"$f":"VLOOKUP(F166,A:B,2,0)","v":{"$error":"#N/A"}},"#EXTINF:-1 tvg-name=\"优漫卡通\",优漫卡通"]
["239.77.0.253:5146","HD (V: h264; A: mp2@2ch)",null,null,"239.77.0.222:5146","239.77.0.222:5146",{"$f":"VLOOKUP(F167,A:B,2,0)","v":"SD (V: h264; A: mp2@1ch)"},"http://faim.top:12306/rtp/239.77.0.222:5146"]
["239.77.0.254:5146","HD (V: h264; A: mp2@2ch)",null,null,"-","",{"$f":"VLOOKUP(F168,A:B,2,0)","v":{"$error":"#N/A"}},"#EXTINF:-1 tvg-name=\"三沙卫视\",三沙卫视"]
["239.77.1.2:5146","HD (V: h264; A: mp2@2ch)",null,null,"239.253.43.113:5146","239.253.43.113:5146",{"$f":"VLOOKUP(F169,A:B,2,0)","v":"HD (V: h264; A: mp2@2ch)"},"http://faim.top:12306/rtp/239.253.43.113:5146"]
["239.77.1.3:5146","HD (V: h264; A: mp2@2ch)",null,null,"-","",{"$f":"VLOOKUP(F170,A:B,2,0)","v":{"$error":"#N/A"}},"#EXTINF:-1 tvg-name=\"吉林延边卫视\",吉林延边卫视"]
["239.77.1.4:5146","HD (V: h264; A: mp2@2ch)",null,null,"239.77.0.10:5146","239.77.0.10:5146",{"$f":"VLOOKUP(F171,A:B,2,0)","v":"SD (V: h264; A: mp2@2ch)"},"http://faim.top:12306/rtp/239.77.0.10:5146"]
["239.77.1.5:5146","HD (V: h264; A: mp2@2ch)",null,null,"-","",{"$f":"VLOOKUP(F172,A:B,2,0)","v":{"$error":"#N/A"}},"#EXTINF:-1 tvg-name=\"CETV2\",CETV2"]
["239.77.1.6:5146","HD (V: h264; A: mp2@2ch)",null,null,"239.77.0.28:5146","239.77.0.28:5146",{"$f":"VLOOKUP(F173,A:B,2,0)","v":"SD (V: h264; A: mp2@2ch)"},"http://faim.top:12306/rtp/239.77.0.28:5146"]
["239.77.1.7:5146","HD (V: h264; A: mp2@2ch)",null,null,"-","",{"$f":"VLOOKUP(F174,A:B,2,0)","v":{"$error":"#N/A"}},"#EXTINF:-1 tvg-name=\"CETV4\",CETV4"]
["239.77.1.8:5146","HD (V: h264; A: mp2@2ch)",null,null,"239.253.43.114:5146","239.253.43.114:5146",{"$f":"VLOOKUP(F175,A:B,2,0)","v":"HD (V: h264; A: mp2@2ch)"},"http://faim.top:12306/rtp/239.253.43.114:5146"]
["239.77.1.9:5146","HD (V: h264; A: mp2@2ch)",null,null,"-","",{"$f":"VLOOKUP(F176,A:B,2,0)","v":{"$error":"#N/A"}},"#EXTINF:-1 tvg-name=\"广东卫视高清\",广东卫视高清"]
["239.77.1.10:5146","HD (V: h264; A: mp2@2ch)",null,null,"239.77.0.84:5146","239.77.0.84:5146",{"$f":"VLOOKUP(F177,A:B,2,0)","v":"HD (V: h264; A: mp2@2ch)"},"http://faim.top:12306/rtp/239.77.0.84:5146"]
["239.77.1.11:5146","SD (V: h264; A: mp2@2ch)",null,null,"-","",{"$f":"VLOOKUP(F178,A:B,2,0)","v":{"$error":"#N/A"}},"#EXTINF:-1 tvg-name=\"经济科教高清\",经济科教高清"]
["239.77.1.12:5146","SD (V: h264; A: mp2@2ch)",null,null,"239.77.0.85:5146","239.77.0.85:5146",{"$f":"VLOOKUP(F179,A:B,2,0)","v":"HD (V: h264; A: mp2@2ch)"},"http://faim.top:12306/rtp/239.77.0.85:5146"]
["239.77.1.13:5146","4K (V: hevc; A: ac3@6ch)",null,null,"-","",{"$f":"VLOOKUP(F180,A:B,2,0)","v":{"$error":"#N/A"}},"#EXTINF:-1 tvg-name=\"广东体育高清-测试\",广东体育高清-测试"]
["239.77.1.14:5146","4K (V: hevc; A: ac3@6ch)",null,null,"239.77.0.112:5146","239.77.0.112:5146",{"$f":"VLOOKUP(F181,A:B,2,0)","v":"HD (V: h264; A: mp2@2ch)"},"http://faim.top:12306/rtp/239.77.0.112:5146"]
["239.77.1.15:5146","SD (V: h264; A: mp2@2ch)",null,null,"-","",{"$f":"VLOOKUP(F182,A:B,2,0)","v":{"$error":"#N/A"}},"#EXTINF:-1 tvg-name=\"广东珠江高清\",广东珠江高清"]
["239.77.1.17:5146","HD (V: h264; A: mp2@2ch)",null,null,"239.77.0.1:5146","239.77.0.1:5146",{"$f":"VLOOKUP(F183,A:B,2,0)","v":"HD (V: h264; A: mp2@2ch)"},"http://faim.top:12306/rtp/239.77.0.1:5146"]
["239.77.1.18:5146","HD (V: h264; A: mp2@2ch)",null,null,"-","",{"$f":"VLOOKUP(F184,A:B,2,0)","v":{"$error":"#N/A"}},"#EXTINF:-1 tvg-name=\"大湾区卫视高清\",大湾区卫视高清"]
["239.77.1.19:5146","HD (V: h264; A: mp2@2ch)",null,null,"239.77.0.215:5146","239.77.0.215:5146",{"$f":"VLOOKUP(F185,A:B,2,0)","v":"HD (V: h264; A: mp2@2ch)"},"http://faim.top:12306/rtp/239.77.0.215:5146"]
["239.77.1.20:5146","HD (V: h264; A: mp2@2ch)",null,null,"-","",{"$f":"VLOOKUP(F186,A:B,2,0)","v":{"$error":"#N/A"}},"#EXTINF:-1 tvg-name=\"广东影视高清\",广东影视高清"]
["239.77.1.21:5146","HD (V: h264; A: mp2@2ch)",null,null,"239.77.0.217:5146","239.77.0.217:5146",{"$f":"VLOOKUP(F187,A:B,2,0)","v":"HD (V: h264; A: mp2@2ch)"},"http://faim.top:12306/rtp/239.77.0.217:5146"]
["239.77.1.22:5146","HD (V: h264; A: mp2@2ch)",null,null,"-","",{"$f":"VLOOKUP(F188,A:B,2,0)","v":{"$error":"#N/A"}},"#EXTINF:-1 tvg-name=\"广东民生高清\",广东民生高清"]
["239.77.1.23:5146","HD (V: h264; A: mp2@2ch)",null,null,"239.77.0.225:5146","239.77.0.225:5146",{"$f":"VLOOKUP(F189,A:B,2,0)","v":"HD (V: h264; A: mp2@2ch)"},"http://faim.top:12306/rtp/239.77.0.225:5146"]
["239.77.1.27:5146","SD (V: h264; A: mp2@2ch)",null,null,"-","",{"$f":"VLOOKUP(F190,A:B,2,0)","v":{"$error":"#N/A"}},"#EXTINF:-1 tvg-name=\"广东少儿高清\",广东少儿高清"]
["239.77.1.31:5146","HD (V: h264; A: mp2@2ch)",null,null,"239.77.0.250:5146","239.77.0.250:5146",{"$f":"VLOOKUP(F191,A:B,2,0)","v":"HD (V: h264; A: mp2@2ch)"},"http://faim.top:12306/rtp/239.77.0.250:5146"]
["239.77.1.33:5146","HD (V: h264; A: mp2@2ch)",null,null,"-","",{"$f":"VLOOKUP(F192,A:B,2,0)","v":{"$error":"#N/A"}},"#EXTINF:-1 tvg-name=\"广东新闻高清\",广东新闻高清"]
["239.77.1.35:5146","SD (V: h264; A: mp2@2ch)",null,null,"239.77.0.173:5146","239.77.0.173:5146",{"$f":"VLOOKUP(F193,A:B,2,0)","v":"HD (V: h264; A: mp2@2ch)"},"http://faim.top:12306/rtp/239.77.0.173:5146"]
["239.77.1.42:5146","SD (V: h264; A: mp2@2ch)",null,null,"-","",{"$f":"VLOOKUP(F194,A:B,2,0)","v":{"$error":"#N/A"}},"#EXTINF:-1 tvg-name=\"嘉佳卡通高清\",嘉佳卡通高清"]
["239.77.1.47:5146","SD (V: h264; A: mp2@2ch)",null,null,{"$f":"IFERROR(VLOOKUP(F195,A:A,1,0),\"-\")","v":"239.77.0.179:5146"},{"$f":"IF(LEFT(H195,1)=\"#\",\"\",MID(H195,FIND(\"rtp\",H195)+4,LEN(H195)-FIND(\"rtp\",H195)-3))","v":"239.77.0.179:5146"},{"$f":"VLOOKUP(F195,A:B,2,0)","v":"HD (V: h264; A: mp2@2ch)"},"http://faim.top:12306/rtp/239.77.0.179:5146"]
["239.77.1.49:5146","SD (V: h264; A: mp2@2ch)",null,null,"-","",{"$f":"VLOOKUP(F196,A:B,2,0)","v":{"$error":"#N/A"}},"#EXTINF:-1 tvg-name=\"CCTV-1高清\",CCTV-1高清"]
["239.77.1.50:5146","SD (V: h264; A: mp2@2ch)",null,null,"239.77.0.86:5146","239.77.0.86:5146",{"$f":"VLOOKUP(F197,A:B,2,0)","v":"HD (V: h264; A: mp2@2ch)"},"http://faim.top:12306/rtp/239.77.0.86:5146"]
["239.77.1.52:5146","SD (V: h264; A: mp2@2ch)",null,null,"-","",{"$f":"VLOOKUP(F198,A:B,2,0)","v":{"$error":"#N/A"}},"#EXTINF:-1 tvg-name=\"CCTV5＋体育高清-测试\",CCTV5＋体育高清-测试"]
["239.77.1.53:5146","SD (V: h264; A: mp2@2ch)",null,null,"239.77.0.87:5146","239.77.0.87:5146",{"$f":"VLOOKUP(F199,A:B,2,0)","v":"HD (V: h264; A: mp2@2ch)"},"http://faim.top:12306/rtp/239.77.0.87:5146"]
["239.77.1.54:5146","SD (V: h264; A: mp2@2ch)",null,null,"-","",{"$f":"VLOOKUP(F200,A:B,2,0)","v":{"$error":"#N/A"}},"#EXTINF:-1 tvg-name=\"CCTV-2高清测试\",CCTV-2高清测试"]
["239.77.1.55:5146","SD (V: h264; A: mp2@2ch)",null,null,"239.77.0.137:5146","239.77.0.137:5146",{"$f":"VLOOKUP(F201,A:B,2,0)","v":"HD (V: h264; A: mp2@2ch)"},"http://faim.top:12306/rtp/239.77.0.137:5146"]
["239.77.1.57:5146","SD (V: h264; A: mp2@2ch)",null,null,"-","",{"$f":"VLOOKUP(F202,A:B,2,0)","v":{"$error":"#N/A"}},"#EXTINF:-1 tvg-name=\"CCTV-3高清\",CCTV-3高清"]
["239.77.1.67:5146","HD (V: h264; A: mp2@2ch)",null,null,"239.77.0.169:5146","239.77.0.169:5146",{"$f":"VLOOKUP(F203,A:B,2,0)","v":"HD (V: h264; A: mp2@2ch)"},"http://faim.top:12306/rtp/239.77.0.169:5146"]
["239.77.1.69:5146","SD (V: h264; A: mp2@2ch)",null,null,"-","",{"$f":"VLOOKUP(F204,A:B,2,0)","v":{"$error":"#N/A"}},"#EXTINF:-1 tvg-name=\"CCTV-4高清\",CCTV-4高清"]
["239.77.1.70:5146","SD (V: h264; A: mp2@2ch)",null,null,"239.77.0.78:5146","239.77.0.78:5146",{"$f":"VLOOKUP(F205,A:B,2,0)","v":"HD (V: h264; A: mp2@2ch)"},"http://faim.top:12306/rtp/239.77.0.78:5146"]
["239.77.1.74:5146","SD (V: h264; A: mp2@2ch)",null,null,"-","",{"$f":"VLOOKUP(F206,A:B,2,0)","v":{"$error":"#N/A"}},"#EXTINF:-1 tvg-name=\"CCTV-5高清\",CCTV-5高清"]
["239.77.1.76:5146","HD (V: h264; A: mp2@2ch)",null,null,"239.77.0.170:5146","239.77.0.170:5146",{"$f":"VLOOKUP(F207,A:B,2,0)","v":"HD (V: h264; A: mp2@2ch)"},"http://faim.top:12306/rtp/239.77.0.170:5146"]
["239.77.1.77:5146","HD (V: h264; A: mp2@2ch)",null,null,"-","",{"$f":"VLOOKUP(F208,A:B,2,0)","v":{"$error":"#N/A"}},"#EXTINF:-1 tvg-name=\"CCTV-6高清\",CCTV-6高清"]
["239.77.1.78:5146","HD (V: h264; A: mp2@2ch)",null,null,"239.77.0.171:5146","239.77.0.171:5146",{"$f":"VLOOKUP(F209,A:B,2,0)","v":"HD (V: h264; A: mp2@2ch)"},"http://faim.top:12306/rtp/239.77.0.171:5146"]
["239.77.1.79:5146","SD (V: h264; A: mp2@2ch)",null,null,"-","",{"$f":"VLOOKUP(F210,A:B,2,0)","v":{"$error":"#N/A"}},"#EXTINF:-1 tvg-name=\"CCTV-7高清测试\",CCTV-7高清测试"]
["239.77.1.80:5146","SD (V: h264; A: mp2@2ch)",null,null,"239.77.0.138:5146","239.77.0.138:5146",{"$f":"VLOOKUP(F211,A:B,2,0)","v":"HD (V: h264; A: mp2@2ch)"},"http://faim.top:12306/rtp/239.77.0.138:5146"]
["239.77.1.82:5146","HD (V: h264; A: mp2@2ch)",null,null,"-","",{"$f":"VLOOKUP(F212,A:B,2,0)","v":{"$error":"#N/A"}},"#EXTINF:-1 tvg-name=\"CCTV-8高清\",CCTV-8高清"]
["239.77.1.83:5146","HD (V: h264; A: mp2@2ch)",null,null,"239.77.0.172:5146","239.77.0.172:5146",{"$f":"VLOOKUP(F213,A:B,2,0)","v":"HD (V: h264; A: mp2@2ch)"},"http://faim.top:12306/rtp/239.77.0.172:5146"]
["239.77.1.84:5146","HD (V: h264; A: mp2@2ch)",null,null,"-","",{"$f":"VLOOKUP(F214,A:B,2,0)","v":{"$error":"#N/A"}},"#EXTINF:-1 tvg-name=\"CCTV-9高清测试\",CCTV-9高清测试"]
["239.77.1.85:5146","HD (V: h264; A: mp2@2ch)",null,null,"239.77.0.135:5146","239.77.0.135:5146",{"$f":"VLOOKUP(F215,A:B,2,0)","v":"HD (V: h264; A: mp2@2ch)"},"http://faim.top:12306/rtp/239.77.0.135:5146"]
["239.77.1.86:5146","HD (V: h264; A: mp2@2ch)",null,null,"-","",{"$f":"VLOOKUP(F216,A:B,2,0)","v":{"$error":"#N/A"}},"#EXTINF:-1 tvg-name=\"CCTV-10高清测试\",CCTV-10高清测试"]
["239.77.1.87:5146","HD (V: h264; A: mp2@2ch)",null,null,"239.77.0.134:5146","239.77.0.134:5146",{"$f":"VLOOKUP(F217,A:B,2,0)","v":"HD (V: h264; A: mp2@2ch)"},"http://faim.top:12306/rtp/239.77.0.134:5146"]
["239.77.1.88:5146","HD (V: h264; A: mp2@2ch)",null,null,"-","",{"$f":"VLOOKUP(F218,A:B,2,0)","v":{"$error":"#N/A"}},"#EXTINF:-1 tvg-name=\"CCTV-11高清\",CCTV-11高清"]
["239.77.1.89:5146","HD (V: h264; A: mp2@2ch)",null,null,"239.77.1.238:5146","239.77.1.238:5146",{"$f":"VLOOKUP(F219,A:B,2,0)","v":"HD (V: h264; A: mp2@2ch)"},"http://faim.top:12306/rtp/239.77.1.238:5146"]
["239.77.1.90:5146","HD (V: h264; A: mp2@2ch)",null,null,"-","",{"$f":"VLOOKUP(F220,A:B,2,0)","v":{"$error":"#N/A"}},"#EXTINF:-1 tvg-name=\"CCTV-12高清测试\",CCTV-12高清测试"]
["239.77.1.91:5146","HD (V: h264; A: mp2@2ch)",null,null,"239.77.0.136:5146","239.77.0.136:5146",{"$f":"VLOOKUP(F221,A:B,2,0)","v":"HD (V: h264; A: mp2@2ch)"},"http://faim.top:12306/rtp/239.77.0.136:5146"]
["239.77.1.92:5146","HD (V: h264; A: mp2@2ch)",null,null,"-","",{"$f":"VLOOKUP(F222,A:B,2,0)","v":{"$error":"#N/A"}},"#EXTINF:-1 tvg-name=\"CCTV-13高清\",CCTV-13高清"]
["239.77.1.93:5146","HD (V: h264; A: mp2@2ch)",null,null,"239.77.0.188:5146","239.77.0.188:5146",{"$f":"VLOOKUP(F223,A:B,2,0)","v":"HD (V: h264; A: mp2@2ch)"},"http://faim.top:12306/rtp/239.77.0.188:5146"]
["239.77.1.94:5146","SD (V: h264; A: mp2@2ch)",null,null,"-","",{"$f":"VLOOKUP(F224,A:B,2,0)","v":{"$error":"#N/A"}},"#EXTINF:-1 tvg-name=\"CCTV-14高清测试\",CCTV-14高清测试"]
["239.77.1.97:5146","SD (V: h264; A: mp2@2ch)",null,null,"239.77.0.133:5146","239.77.0.133:5146",{"$f":"VLOOKUP(F225,A:B,2,0)","v":"HD (V: h264; A: mp2@2ch)"},"http://faim.top:12306/rtp/239.77.0.133:5146"]
["239.77.1.99:5146","SD (V: h264; A: mp2@2ch)",null,null,"-","",{"$f":"VLOOKUP(F226,A:B,2,0)","v":{"$error":"#N/A"}},"#EXTINF:-1 tvg-name=\"CCTV-15高清\",CCTV-15高清"]
["239.77.1.103:5146","HD (V: h264; A: mp2@2ch)",null,null,"239.77.1.239:5146","239.77.1.239:5146",{"$f":"VLOOKUP(F227,A:B,2,0)","v":"HD (V: h264; A: mp2@2ch)"},"http://faim.top:12306/rtp/239.77.1.239:5146"]
["239.77.1.104:5146","HD (V: h264; A: mp2@2ch)",null,null,"-","",{"$f":"VLOOKUP(F228,A:B,2,0)","v":{"$error":"#N/A"}},"#EXTINF:-1 tvg-name=\"爱体育高清\",爱体育高清"]
["239.77.1.105:5146","SD (V: h264; A: mp2@2ch)",null,null,"239.77.0.176:5146","239.77.0.176:5146",{"$f":"VLOOKUP(F229,A:B,2,0)","v":"HD (V: h264; A: mp2@2ch)"},"http://faim.top:12306/rtp/239.77.0.176:5146"]
["239.77.1.107:5146","HD (V: h264; A: ac3@6ch)",null,null,"-","",{"$f":"VLOOKUP(F230,A:B,2,0)","v":{"$error":"#N/A"}},"#EXTINF:-1 tvg-name=\"CCTV-16高清\",CCTV-16高清"]
["239.77.1.108:5146","HD (V: h264; A: mp2@2ch)",null,null,"239.77.0.165:5146","239.77.0.165:5146",{"$f":"VLOOKUP(F231,A:B,2,0)","v":"HD (V: h264; A: mp2@2ch)"},"http://faim.top:12306/rtp/239.77.0.165:5146"]
["239.77.1.109:5146","HD (V: h264; A: mp2@2ch)",null,null,"-","",{"$f":"VLOOKUP(F232,A:B,2,0)","v":{"$error":"#N/A"}},"#EXTINF:-1 tvg-name=\"CCTV-17农业高清\",CCTV-17农业高清"]
["239.77.1.111:5146","HD (V: h264; A: mp2@2ch)",null,null,"239.77.0.198:5146","239.77.0.198:5146",{"$f":"VLOOKUP(F233,A:B,2,0)","v":"HD (V: h264; A: mp2@2ch)"},"http://faim.top:12306/rtp/239.77.0.198:5146"]
["239.77.1.112:5146","SD (V: h264; A: mp2@2ch)",null,null,"-","",{"$f":"VLOOKUP(F234,A:B,2,0)","v":{"$error":"#N/A"}},"#EXTINF:-1 tvg-name=\"CCTV4中文国际欧洲高清\",CCTV4中文国际欧洲高清"]
["239.77.1.113:5146","HD (V: h264; A: mp2@2ch)",null,null,"239.253.43.120:5146","239.253.43.120:5146",{"$f":"VLOOKUP(F235,A:B,2,0)","v":"HD (V: h264; A: mp2@2ch)"},"http://faim.top:12306/rtp/239.253.43.120:5146"]
["239.77.1.114:5146","HD (V: h264; A: mp2@2ch)",null,null,"-","",{"$f":"VLOOKUP(F236,A:B,2,0)","v":{"$error":"#N/A"}},"#EXTINF:-1 tvg-name=\"CCTV4中文国际美洲高清\",CCTV4中文国际美洲高清"]
["239.77.1.115:5146","SD (V: h264; A: mp2@2ch)",null,null,"239.253.43.121:5146","239.253.43.121:5146",{"$f":"VLOOKUP(F237,A:B,2,0)","v":"HD (V: h264; A: mp2@2ch)"},"http://faim.top:12306/rtp/239.253.43.121:5146"]
["239.77.1.116:5146","HD (V: h264; A: mp2@2ch)",null,null,"-","",{"$f":"VLOOKUP(F238,A:B,2,0)","v":{"$error":"#N/A"}},"#EXTINF:-1 tvg-name=\"CGTN英语高清\",CGTN英语高清"]
["239.77.1.117:5146","SD (V: h264; A: mp2@2ch)",null,null,"239.77.0.199:5146","239.77.0.199:5146",{"$f":"VLOOKUP(F239,A:B,2,0)","v":"HD (V: h264; A: mp2@2ch)"},"http://faim.top:12306/rtp/239.77.0.199:5146"]
["239.77.1.120:5146","HD (V: h264; A: mp2@2ch)",null,null,"-","",{"$f":"VLOOKUP(F240,A:B,2,0)","v":{"$error":"#N/A"}},"#EXTINF:-1 tvg-name=\"CGTN英文记录高清\",CGTN英文记录高清"]
["239.77.1.121:5146","HD (V: h264; A: mp2@2ch)",null,null,"239.253.43.122:5146","239.253.43.122:5146",{"$f":"VLOOKUP(F241,A:B,2,0)","v":"HD (V: h264; A: mp2@2ch)"},"http://faim.top:12306/rtp/239.253.43.122:5146"]
["239.77.1.122:5146","HD (V: h264; A: mp2@2ch)",null,null,"-","",{"$f":"VLOOKUP(F242,A:B,2,0)","v":{"$error":"#N/A"}},"#EXTINF:-1 tvg-name=\"CGTN西班牙语高清\",CGTN西班牙语高清"]
["239.77.1.124:5146","HD (V: h264; A: mp2@2ch)",null,null,"239.77.0.221:5146","239.77.0.221:5146",{"$f":"VLOOKUP(F243,A:B,2,0)","v":"HD (V: h264; A: mp2@2ch)"},"http://faim.top:12306/rtp/239.77.0.221:5146"]
["239.77.1.125:5146","HD (V: h264; A: mp2@2ch)",null,null,"-","",{"$f":"VLOOKUP(F244,A:B,2,0)","v":{"$error":"#N/A"}},"#EXTINF:-1 tvg-name=\"CGTN法语高清\",CGTN法语高清"]
["239.77.1.128:5146","HD (V: h264; A: mp2@2ch)",null,null,"239.77.0.228:5146","239.77.0.228:5146",{"$f":"VLOOKUP(F245,A:B,2,0)","v":"HD (V: h264; A: mp2@2ch)"},"http://faim.top:12306/rtp/239.77.0.228:5146"]
["239.77.1.129:5146","HD (V: cavs; A: eac3@6ch)",null,null,"-","",{"$f":"VLOOKUP(F246,A:B,2,0)","v":{"$error":"#N/A"}},"#EXTINF:-1 tvg-name=\"CGTN阿拉伯语高清\",CGTN阿拉伯语高清"]
["239.77.1.130:5146","HD (V: h264; A: mp2@2ch)",null,null,"239.253.43.200:5146","239.253.43.200:5146",{"$f":"VLOOKUP(F247,A:B,2,0)","v":"HD (V: h264; A: mp2@2ch)"},"http://faim.top:12306/rtp/239.253.43.200:5146"]
["239.77.1.131:5146","HD (V: h264; A: mp2@2ch)",null,null,"-","",{"$f":"VLOOKUP(F248,A:B,2,0)","v":{"$error":"#N/A"}},"#EXTINF:-1 tvg-name=\"CGTN俄语高清\",CGTN俄语高清"]
["239.77.1.132:5146"," (; )",null,null,"239.253.43.201:5146","239.253.43.201:5146",{"$f":"VLOOKUP(F249,A:B,2,0)","v":"HD (V: h264; A: mp2@2ch)"},"http://faim.top:12306/rtp/239.253.43.201:5146"]
["239.77.1.138:5146","HD (V: h264; A: mp2@2ch)",null,null,"-","",{"$f":"VLOOKUP(F250,A:B,2,0)","v":{"$error":"#N/A"}},"#EXTINF:-1 tvg-name=\"金鹰纪实高清测试\",金鹰纪实高清测试"]
["239.77.1.139:5146","SD (V: h264; A: mp2@2ch)",null,null,"239.77.0.160:5146","239.77.0.160:5146",{"$f":"VLOOKUP(F251,A:B,2,0)","v":"HD (V: h264; A: mp2@2ch)"},"http://faim.top:12306/rtp/239.77.0.160:5146"]
["239.77.1.140:5146","HD (V: h264; A: mp2@2ch)",null,null,"-","",{"$f":"VLOOKUP(F252,A:B,2,0)","v":{"$error":"#N/A"}},"#EXTINF:-1 tvg-name=\"中国交通\",中国交通"]
["239.77.1.141:5146","HD (V: h264; A: mp2@2ch)",null,null,"-","239.77.1.249:5146",{"$f":"VLOOKUP(F253,A:B,2,0)","v":{"$error":"#N/A"}},"http://faim.top:12306/rtp/239.77.1.249:5146"]
["239.77.1.142:5146","HD (V: h264; A: mp2@2ch)",null,null,"-","",{"$f":"VLOOKUP(F254,A:B,2,0)","v":{"$error":"#N/A"}},"#EXTINF:-1 tvg-name=\"上海纪实高清\",上海纪实高清"]
["239.77.1.144:5146","HD (V: h264; A: mp2@2ch)",null,null,"-","239.77.0.147:5146",{"$f":"VLOOKUP(F255,A:B,2,0)","v":{"$error":"#N/A"}},"http://faim.top:12306/rtp/239.77.0.147:5146"]
["239.77.1.147:5146"," (; )",null,null,"-","",{"$f":"VLOOKUP(F256,A:B,2,0)","v":{"$error":"#N/A"}},"#EXTINF:-1 tvg-name=\"金鹰卡通高清\",金鹰卡通高清"]
["239.77.1.148:5146","HD (V: h264; A: mp2@2ch)",null,null,"239.77.0.164:5146","239.77.0.164:5146",{"$f":"VLOOKUP(F257,A:B,2,0)","v":"HD (V: h264; A: mp2@2ch)"},"http://faim.top:12306/rtp/239.77.0.164:5146"]
["239.77.1.149:5146","HD (V: cavs; A: ac3@6ch)",null,null,"-","",{"$f":"VLOOKUP(F258,A:B,2,0)","v":{"$error":"#N/A"}},"#EXTINF:-1 tvg-name=\"CHC高清电影\",CHC高清电影"]
["239.77.1.150:5146","HD (V: cavs; A: ac3@6ch)",null,null,{"$f":"IFERROR(VLOOKUP(F259,A:A,1,0),\"-\")","v":"-"},{"$f":"IF(LEFT(H259,1)=\"#\",\"\",MID(H259,FIND(\"rtp\",H259)+4,LEN(H259)-FIND(\"rtp\",H259)-3))","v":"239.77.0.27:5146"},{"$f":"VLOOKUP(F259,A:B,2,0)","v":{"$error":"#N/A"}},"http://faim.top:12306/rtp/239.77.0.27:5146"]
["239.77.1.151:5146","HD (V: mpeg2video; A: ac3@6ch)",null,null,"-","",{"$f":"VLOOKUP(F260,A:B,2,0)","v":{"$error":"#N/A"}},"#EXTINF:-1 tvg-name=\"茶\",茶"]
["239.77.1.152:5146","HD (V: mpeg2video; A: ac3@6ch)",null,null,"239.77.0.15:5146","239.77.0.15:5146",{"$f":"VLOOKUP(F261,A:B,2,0)","v":"HD (V: h264; A: mp2@2ch)"},"http://faim.top:12306/rtp/239.77.0.15:5146"]
["239.77.1.153:5146","HD (V: cavs; A: ac3@6ch)",null,null,"-","",{"$f":"VLOOKUP(F262,A:B,2,0)","v":{"$error":"#N/A"}},"#EXTINF:-1 tvg-name=\"快乐垂钓\",快乐垂钓"]
["239.77.1.156:5146","HD (V: cavs; A: eac3@6ch)",null,null,"239.77.0.145:5146","239.77.0.145:5146",{"$f":"VLOOKUP(F263,A:B,2,0)","v":"HD (V: h264; A: mp2@2ch)"},"http://faim.top:12306/rtp/239.77.0.145:5146"]
["239.77.1.157:5146","HD (V: cavs; A: ac3@2ch)",null,null,"-","",{"$f":"VLOOKUP(F264,A:B,2,0)","v":{"$error":"#N/A"}},"#EXTINF:-1 tvg-name=\"广东卫视超清\",广东卫视超清"]
["239.77.1.158:5146","HD (V: h264; A: mp2@2ch)",null,null,"239.77.0.166:5146","239.77.0.166:5146",{"$f":"VLOOKUP(F265,A:B,2,0)","v":"HD (V: h264; A: mp2@2ch)"},"http://faim.top:12306/rtp/239.77.0.166:5146"]
["239.77.1.159:5146","HD (V: h264; A: mp2@2ch)",null,null,"-","",{"$f":"VLOOKUP(F266,A:B,2,0)","v":{"$error":"#N/A"}},"#EXTINF:-1 tvg-name=\"经济科教超清\",经济科教超清"]
["239.77.1.160:5146","HD (V: h264; A: mp2@2ch)",null,null,"239.77.0.167:5146","239.77.0.167:5146",{"$f":"VLOOKUP(F267,A:B,2,0)","v":"HD (V: h264; A: mp2@2ch)"},"http://faim.top:12306/rtp/239.77.0.167:5146"]
["239.77.1.161:5146","HD (V: h264; A: mp2@2ch)",null,null,"-","",{"$f":"VLOOKUP(F268,A:B,2,0)","v":{"$error":"#N/A"}},"#EXTINF:-1 tvg-name=\"广东体育超清\",广东体育超清"]
["239.77.1.162:5146","HD (V: h264; A: mp2@2ch)",null,null,"239.77.0.168:5146","239.77.0.168:5146",{"$f":"VLOOKUP(F269,A:B,2,0)","v":"HD (V: h264; A: mp2@2ch)"},"http://faim.top:12306/rtp/239.77.0.168:5146"]
["239.77.1.163:5146","HD (V: h264; A: mp2@2ch)",null,null,"-","",{"$f":"VLOOKUP(F270,A:B,2,0)","v":{"$error":"#N/A"}},"#EXTINF:-1 tvg-name=\"广东珠江超清\",广东珠江超清"]
["239.77.1.166:5146","HD (V: h264; A: ac3@6ch)",null,null,"239.77.0.114:5146","239.77.0.114:5146",{"$f":"VLOOKUP(F271,A:B,2,0)","v":"HD (V: h264; A: mp2@2ch)"},"http://faim.top:12306/rtp/239.77.0.114:5146"]
["239.77.1.167:5146","HD (V: cavs; A: ac3@6ch)",null,null,"-","",{"$f":"VLOOKUP(F272,A:B,2,0)","v":{"$error":"#N/A"}},"#EXTINF:-1 tvg-name=\"CCTV-1超清\",CCTV-1超清"]
["239.77.1.168:5146","HD (V: cavs; A: ac3@6ch)",null,null,"239.77.0.129:5146","239.77.0.129:5146",{"$f":"VLOOKUP(F273,A:B,2,0)","v":"HD (V: h264; A: mp2@2ch)"},"http://faim.top:12306/rtp/239.77.0.129:5146"]
["239.77.1.169:5146","HD (V: cavs; A: ac3@6ch)",null,null,"-","",{"$f":"VLOOKUP(F274,A:B,2,0)","v":{"$error":"#N/A"}},"#EXTINF:-1 tvg-name=\"CCTV-3超清\",CCTV-3超清"]
["239.77.1.170:5146","HD (V: cavs; A: ac3@6ch)",null,null,"239.77.0.175:5146","239.77.0.175:5146",{"$f":"VLOOKUP(F275,A:B,2,0)","v":"HD (V: cavs; A: ac3@6ch)"},"http://faim.top:12306/rtp/239.77.0.175:5146"]
["239.77.1.171:5146","HD (V: cavs; A: ac3@6ch)",null,null,"-","",{"$f":"VLOOKUP(F276,A:B,2,0)","v":{"$error":"#N/A"}},"#EXTINF:-1 tvg-name=\"CCTV-5超清\",CCTV-5超清"]
["239.77.1.174:5146","HD (V: mpeg2video; A: ac3@2ch)",null,null,"239.77.0.177:5146","239.77.0.177:5146",{"$f":"VLOOKUP(F277,A:B,2,0)","v":"HD (V: cavs; A: ac3@6ch)"},"http://faim.top:12306/rtp/239.77.0.177:5146"]
["239.77.1.175:5146","SD (V: h264; A: mp2@2ch)",null,null,"-","",{"$f":"VLOOKUP(F278,A:B,2,0)","v":{"$error":"#N/A"}},"#EXTINF:-1 tvg-name=\"CCTV-6超清\",CCTV-6超清"]
["239.77.1.176:5146","HD (V: h264; A: mp2@2ch)",null,null,"239.77.0.178:5146","239.77.0.178:5146",{"$f":"VLOOKUP(F279,A:B,2,0)","v":"HD (V: cavs; A: ac3@2ch)"},"http://faim.top:12306/rtp/239.77.0.178:5146"]
["239.77.1.177:5146","HD (V: h264; A: mp2@2ch)",null,null,"-","",{"$f":"VLOOKUP(F280,A:B,2,0)","v":{"$error":"#N/A"}},"#EXTINF:-1 tvg-name=\"CCTV-8超清\",CCTV-8超清"]
["239.77.1.179:5146","HD (V: mpeg2video; A: ac3@2ch)",null,null,"239.77.0.181:5146","239.77.0.181:5146",{"$f":"VLOOKUP(F281,A:B,2,0)","v":"HD (V: cavs; A: ac3@6ch)"},"http://faim.top:12306/rtp/239.77.0.181:5146"]
["239.77.1.180:5146","4K (V: hevc; A: aac@2ch)",null,null,"-","",{"$f":"VLOOKUP(F282,A:B,2,0)","v":{"$error":"#N/A"}},"#EXTINF:-1 tvg-name=\"湖南卫视超清\",湖南卫视超清"]
["239.77.1.182:5146","HD (V: mpeg2video; A: ac3@2ch)",null,null,"239.77.0.127:5146","239.77.0.127:5146",{"$f":"VLOOKUP(F283,A:B,2,0)","v":"HD (V: cavs; A: eac3@6ch, ac3@6ch)"},"http://faim.top:12306/rtp/239.77.0.127:5146"]
["239.77.1.183:5146","SD (V: h264; A: mp2@2ch)",null,null,"-","",{"$f":"VLOOKUP(F284,A:B,2,0)","v":{"$error":"#N/A"}},"#EXTINF:-1 tvg-name=\"浙江卫视超清\",浙江卫视超清"]
["239.77.1.184:5146","SD (V: h264; A: mp2@2ch)",null,null,"239.77.0.125:5146","239.77.0.125:5146",{"$f":"VLOOKUP(F285,A:B,2,0)","v":"HD (V: cavs; A: ac3@6ch)"},"http://faim.top:12306/rtp/239.77.0.125:5146"]
["239.77.1.195:5146","SD (V: h264; A: mp2@2ch)",null,null,"-","",{"$f":"VLOOKUP(F286,A:B,2,0)","v":{"$error":"#N/A"}},"#EXTINF:-1 tvg-name=\"江苏卫视超清\",江苏卫视超清"]
["239.77.1.197:5146","SD (V: h264; A: mp2@1ch)",null,null,"239.77.0.126:5146","239.77.0.126:5146",{"$f":"VLOOKUP(F287,A:B,2,0)","v":"HD (V: cavs; A: ac3@6ch)"},"http://faim.top:12306/rtp/239.77.0.126:5146"]
["239.77.1.198:5146","SD (V: h264; A: mp2@2ch)",null,null,"-","",{"$f":"VLOOKUP(F288,A:B,2,0)","v":{"$error":"#N/A"}},"#EXTINF:-1 tvg-name=\"深圳卫视超清\",深圳卫视超清"]
["239.77.1.205:5146","SD (V: h264; A: mp2@2ch)",null,null,"239.77.0.130:5146","239.77.0.130:5146",{"$f":"VLOOKUP(F289,A:B,2,0)","v":"HD (V: mpeg2video; A: ac3@2ch)"},"http://faim.top:12306/rtp/239.77.0.130:5146"]
["239.77.1.214:5146","HD (V: h264; A: mp2@2ch)",null,null,"-","",{"$f":"VLOOKUP(F290,A:B,2,0)","v":{"$error":"#N/A"}},"#EXTINF:-1 tvg-name=\"黑龙江卫视超清\",黑龙江卫视超清"]
["239.77.1.215:5146","HD (V: h264; A: mp2@2ch)",null,null,"239.77.0.124:5146","239.77.0.124:5146",{"$f":"VLOOKUP(F291,A:B,2,0)","v":"HD (V: mpeg2video; A: ac3@2ch, mp2@2ch)"},"http://faim.top:12306/rtp/239.77.0.124:5146"]
["239.77.1.217:5146","HD (V: h264; A: mp2@2ch)",null,null,"-","",{"$f":"VLOOKUP(F292,A:B,2,0)","v":{"$error":"#N/A"}},"#EXTINF:-1 tvg-name=\"湖北卫视超清\",湖北卫视超清"]
["239.77.1.218:5146","HD (V: h264; A: mp2@2ch)",null,null,"239.77.0.128:5146","239.77.0.128:5146",{"$f":"VLOOKUP(F293,A:B,2,0)","v":"HD (V: mpeg2video; A: ac3@2ch)"},"http://faim.top:12306/rtp/239.77.0.128:5146"]
["239.77.1.219:5146","HD (V: h264; A: mp2@2ch)",null,null,"-","",{"$f":"VLOOKUP(F294,A:B,2,0)","v":{"$error":"#N/A"}},"#EXTINF:-1 tvg-name=\"天津卫视超清\",天津卫视超清"]
["239.77.1.221:5146","HD (V: h264; A: mp2@2ch)",null,null,"239.77.0.131:5146","239.77.0.131:5146",{"$f":"VLOOKUP(F295,A:B,2,0)","v":"HD (V: mpeg2video; A: ac3@2ch)"},"http://faim.top:12306/rtp/239.77.0.131:5146"]
["239.77.1.222:5146","HD (V: h264; A: mp2@2ch)",null,null,"-","",{"$f":"VLOOKUP(F296,A:B,2,0)","v":{"$error":"#N/A"}},"#EXTINF:-1 tvg-name=\"山东卫视超清\",山东卫视超清"]
["239.77.1.223:5146","HD (V: h264; A: mp2@2ch)",null,null,"239.77.0.132:5146","239.77.0.132:5146",{"$f":"VLOOKUP(F297,A:B,2,0)","v":"HD (V: cavs; A: mp2@2ch, ac3@6ch)"},"http://faim.top:12306/rtp/239.77.0.132:5146"]
["239.77.1.225:5146","SD (V: h264; A: mp2@2ch)",null,null,"-","",{"$f":"VLOOKUP(F298,A:B,2,0)","v":{"$error":"#N/A"}},"#EXTINF:-1 tvg-name=\"辽宁卫视超清\",辽宁卫视超清"]
["239.77.1.229:5146","HD (V: h264; A: mp2@2ch)",null,null,"239.77.0.161:5146","239.77.0.161:5146",{"$f":"VLOOKUP(F299,A:B,2,0)","v":"HD (V: cavs; A: ac3@6ch)"},"http://faim.top:12306/rtp/239.77.0.161:5146"]
["239.77.1.232:5146","HD (V: h264; A: mp2@2ch)",null,null,"-","",{"$f":"VLOOKUP(F300,A:B,2,0)","v":{"$error":"#N/A"}},"#EXTINF:-1 tvg-name=\"金鹰纪实超清测试\",金鹰纪实超清测试"]
["239.77.1.233:5146","HD (V: h264; A: mp2@2ch)",null,null,"239.77.0.162:5146","239.77.0.162:5146",{"$f":"VLOOKUP(F301,A:B,2,0)","v":"HD (V: cavs; A: ac3@6ch)"},"http://faim.top:12306/rtp/239.77.0.162:5146"]
["239.77.1.234:5146","HD (V: h264; A: mp2@2ch, mp2@2ch, mp2@2ch, mp2@2ch)",null,null,"-","",{"$f":"VLOOKUP(F302,A:B,2,0)","v":{"$error":"#N/A"}},"#EXTINF:-1 tvg-name=\"四川卫视超清\",四川卫视超清"]
["239.77.1.237:5146","4K (V: hevc; A: aac@2ch)",null,null,"239.77.0.163:5146","239.77.0.163:5146",{"$f":"VLOOKUP(F303,A:B,2,0)","v":"HD (V: cavs; A: ac3@6ch)"},"http://faim.top:12306/rtp/239.77.0.163:5146"]
["239.77.1.238:5146","HD (V: h264; A: mp2@2ch)",null,null,"-","",{"$f":"VLOOKUP(F304,A:B,2,0)","v":{"$error":"#N/A"}},"#EXTINF:-1 tvg-name=\"IPTV谍战剧场\",IPTV谍战剧场"]
["239.77.1.239:5146","HD (V: h264; A: mp2@2ch)",null,null,"239.77.0.99:5146","239.77.0.99:5146",{"$f":"VLOOKUP(F305,A:B,2,0)","v":"HD (V: h264; A: mp2@2ch)"},"http://faim.top:12306/rtp/239.77.0.99:5146"]
["239.77.1.242:5146","HD (V: h264; A: mp2@2ch)",null,null,"-","",{"$f":"VLOOKUP(F306,A:B,2,0)","v":{"$error":"#N/A"}},"#EXTINF:-1 tvg-name=\"IPTV相声小品\",IPTV相声小品"]
["239.77.1.244:5146","HD (V: h264; A: mp2@2ch)",null,null,"239.77.0.100:5146","239.77.0.100:5146",{"$f":"VLOOKUP(F307,A:B,2,0)","v":"HD (V: h264; A: mp2@2ch)"},"http://faim.top:12306/rtp/239.77.0.100:5146"]
["239.253.43.1:5146","HD (V: h264; A: mp2@2ch)",null,null,"-","",{"$f":"VLOOKUP(F308,A:B,2,0)","v":{"$error":"#N/A"}},"#EXTINF:-1 tvg-name=\"IPTV野外\",IPTV野外"]
["239.253.43.2:5146","HD (V: h264; A: mp2@2ch)",null,null,"239.77.0.101:5146","239.77.0.101:5146",{"$f":"VLOOKUP(F309,A:B,2,0)","v":"HD (V: h264; A: mp2@2ch)"},"http://faim.top:12306/rtp/239.77.0.101:5146"]
["239.253.43.5:5146","HD (V: h264; A: mp2@2ch)",null,null,"-","",{"$f":"VLOOKUP(F310,A:B,2,0)","v":{"$error":"#N/A"}},"#EXTINF:-1 tvg-name=\"IPTV法治\",IPTV法治"]
["239.253.43.6:5146","HD (V: h264; A: mp2@2ch)",null,null,"239.77.0.102:5146","239.77.0.102:5146",{"$f":"VLOOKUP(F311,A:B,2,0)","v":"HD (V: h264; A: mp2@2ch)"},"http://faim.top:12306/rtp/239.77.0.102:5146"]
["239.253.43.7:5146","HD (V: h264; A: mp2@2ch)",null,null,"-","",{"$f":"VLOOKUP(F312,A:B,2,0)","v":{"$error":"#N/A"}},"#EXTINF:-1 tvg-name=\"爱电影\",爱电影"]
["239.253.43.8:5146","HD (V: h264; A: mp2@2ch)",null,null,"239.77.0.103:5146","239.77.0.103:5146",{"$f":"VLOOKUP(F313,A:B,2,0)","v":"HD (V: h264; A: mp2@2ch)"},"http://faim.top:12306/rtp/239.77.0.103:5146"]
["239.253.43.9:5146","HD (V: h264; A: mp2@2ch)",null,null,"-","",{"$f":"VLOOKUP(F314,A:B,2,0)","v":{"$error":"#N/A"}},"#EXTINF:-1 tvg-name=\"经典电影\",经典电影"]
["239.253.43.10:5146","HD (V: h264; A: mp2@2ch)",null,null,"239.77.0.104:5146","239.77.0.104:5146",{"$f":"VLOOKUP(F315,A:B,2,0)","v":"HD (V: h264; A: mp2@2ch)"},"http://faim.top:12306/rtp/239.77.0.104:5146"]
["239.253.43.11:5146","HD (V: h264; A: mp2@2ch)",null,null,"-","",{"$f":"VLOOKUP(F316,A:B,2,0)","v":{"$error":"#N/A"}},"#EXTINF:-1 tvg-name=\"爱大剧\",爱大剧"]
["239.253.43.12:5146","HD (V: h264; A: mp2@2ch)",null,null,"239.77.0.105:5146","239.77.0.105:5146",{"$f":"VLOOKUP(F317,A:B,2,0)","v":"HD (V: h264; A: mp2@2ch)"},"http://faim.top:12306/rtp/239.77.0.105:5146"]
["239.253.43.13:5146","HD (V: h264; A: mp2@2ch)",null,null,"-","",{"$f":"VLOOKUP(F318,A:B,2,0)","v":{"$error":"#N/A"}},"#EXTINF:-1 tvg-name=\"热播剧场\",热播剧场"]
["239.253.43.14:5146","HD (V: h264; A: mp2@2ch)",null,null,"239.77.0.106:5146","239.77.0.106:5146",{"$f":"VLOOKUP(F319,A:B,2,0)","v":"HD (V: h264; A: mp2@2ch)"},"http://faim.top:12306/rtp/239.77.0.106:5146"]
["239.253.43.15:5146","HD (V: h264; A: mp2@2ch)",null,null,"-","",{"$f":"VLOOKUP(F320,A:B,2,0)","v":{"$error":"#N/A"}},"#EXTINF:-1 tvg-name=\"爱综艺\",爱综艺"]
["239.253.43.16:5146","HD (V: h264; A: mp2@2ch)",null,null,"239.77.0.107:5146","239.77.0.107:5146",{"$f":"VLOOKUP(F321,A:B,2,0)","v":"HD (V: h264; A: mp2@2ch)"},"http://faim.top:12306/rtp/239.77.0.107:5146"]
["239.253.43.17:5146","HD (V: cavs; A: ac3@6ch)",null,null,"-","",{"$f":"VLOOKUP(F322,A:B,2,0)","v":{"$error":"#N/A"}},"#EXTINF:-1 tvg-name=\"爱体育\",爱体育"]
["239.253.43.18:5146","HD (V: h264; A: mp2@2ch)",null,null,{"$f":"IFERROR(VLOOKUP(F323,A:A,1,0),\"-\")","v":"239.77.0.108:5146"},{"$f":"IF(LEFT(H323,1)=\"#\",\"\",MID(H323,FIND(\"rtp\",H323)+4,LEN(H323)-FIND(\"rtp\",H323)-3))","v":"239.77.0.108:5146"},{"$f":"VLOOKUP(F323,A:B,2,0)","v":"HD (V: h264; A: mp2@2ch)"},"http://faim.top:12306/rtp/239.77.0.108:5146"]
["239.253.43.19:5146","HD (V: h264; A: mp2@2ch)",null,null,"-","",{"$f":"VLOOKUP(F324,A:B,2,0)","v":{"$error":"#N/A"}},"#EXTINF:-1 tvg-name=\"少儿动画\",少儿动画"]
["239.253.43.20:5146","HD (V: h264; A: mp2@2ch)",null,null,"239.77.0.109:5146","239.77.0.109:5146",{"$f":"VLOOKUP(F325,A:B,2,0)","v":"HD (V: h264; A: mp2@2ch)"},"http://faim.top:12306/rtp/239.77.0.109:5146"]
["239.253.43.21:5146","HD (V: h264; A: mp2@2ch)",null,null,"-","",{"$f":"VLOOKUP(F326,A:B,2,0)","v":{"$error":"#N/A"}},"#EXTINF:-1 tvg-name=\"魅力时尚\",魅力时尚"]
["239.253.43.22:5146","HD (V: h264; A: mp2@2ch)",null,null,"239.77.0.110:5146","239.77.0.110:5146",{"$f":"VLOOKUP(F327,A:B,2,0)","v":"HD (V: h264; A: mp2@2ch)"},"http://faim.top:12306/rtp/239.77.0.110:5146"]
["239.253.43.23:5146","HD (V: h264; A: mp2@2ch)",null,null,"-","",{"$f":"VLOOKUP(F328,A:B,2,0)","v":{"$error":"#N/A"}},"#EXTINF:-1 tvg-name=\"收视指南\",收视指南"]
["239.253.43.24:5146","HD (V: h264; A: mp2@2ch)",null,null,"239.77.0.111:5146","239.77.0.111:5146",{"$f":"VLOOKUP(F329,A:B,2,0)","v":"HD (V: h264; A: mp2@2ch)"},"http://faim.top:12306/rtp/239.77.0.111:5146"]
["239.253.43.25:5146","HD (V: h264; A: mp2@2ch)",null,null,"-","",{"$f":"VLOOKUP(F330,A:B,2,0)","v":{"$error":"#N/A"}},"#EXTINF:-1 tvg-name=\"4k测试频道8\",4k测试频道8"]
["239.253.43.26:5146","HD (V: h264; A: mp2@2ch)",null,null,"-","239.77.0.249:5146",{"$f":"VLOOKUP(F331,A:B,2,0)","v":{"$error":"#N/A"}},"http://faim.top:12306/rtp/239.77.0.249:5146"]
["239.253.43.27:5146","HD (V: h264; A: mp2@2ch)",null,null,"-","",{"$f":"VLOOKUP(F332,A:B,2,0)","v":{"$error":"#N/A"}},"#EXTINF:-1 tvg-name=\"精选4k频道3\",精选4k频道3"]
["239.253.43.28:5146","HD (V: h264; A: mp2@2ch)",null,null,"239.77.0.153:5146","239.77.0.153:5146",{"$f":"VLOOKUP(F333,A:B,2,0)","v":"SD (V: h264; A: mp2@2ch)"},"http://faim.top:12306/rtp/239.77.0.153:5146"]
["239.253.43.29:5146","HD (V: h264; A: mp2@2ch)",null,null,"-","",{"$f":"VLOOKUP(F334,A:B,2,0)","v":{"$error":"#N/A"}},"#EXTINF:-1 tvg-name=\"求索纪录\",求索纪录"]
["239.253.43.33:5146","HD (V: h264; A: mp2@2ch)",null,null,"239.77.0.21:5146","239.77.0.21:5146",{"$f":"VLOOKUP(F335,A:B,2,0)","v":"HD (V: h264; A: mp2@2ch)"},"http://faim.top:12306/rtp/239.77.0.21:5146"]
["239.253.43.34:5146","HD (V: h264; A: mp2@2ch)",null,null,"-","",{"$f":"VLOOKUP(F336,A:B,2,0)","v":{"$error":"#N/A"}},"#EXTINF:-1 tvg-name=\"百视通体育直播室1\",百视通体育直播室1"]
["239.253.43.35:5146","HD (V: h264; A: mp2@2ch)",null,null,"239.253.43.115:5146","239.253.43.115:5146",{"$f":"VLOOKUP(F337,A:B,2,0)","v":"SD (V: h264; A: mp2@2ch)"},"http://faim.top:12306/rtp/239.253.43.115:5146"]
["239.253.43.36:5146","HD (V: h264; A: mp2@2ch)",null,null,"-","",{"$f":"VLOOKUP(F338,A:B,2,0)","v":{"$error":"#N/A"}},"#EXTINF:-1 tvg-name=\"百视通体育直播室4\",百视通体育直播室4"]
["239.253.43.37:5146","HD (V: h264; A: mp2@2ch)",null,null,"239.253.43.116:5146","239.253.43.116:5146",{"$f":"VLOOKUP(F339,A:B,2,0)","v":"SD (V: h264; A: mp2@2ch)"},"http://faim.top:12306/rtp/239.253.43.116:5146"]
["239.253.43.40:5146","HD (V: h264; A: mp2@2ch)",null,null,"-","",{"$f":"VLOOKUP(F340,A:B,2,0)","v":{"$error":"#N/A"}},"#EXTINF:-1 tvg-name=\"百视通体育直播室5\",百视通体育直播室5"]
["239.253.43.45:5146","HD (V: h264; A: mp2@2ch)",null,null,"239.253.43.117:5146","239.253.43.117:5146",{"$f":"VLOOKUP(F341,A:B,2,0)","v":"SD (V: h264; A: mp2@2ch)"},"http://faim.top:12306/rtp/239.253.43.117:5146"]
["239.253.43.46:5146","HD (V: h264; A: mp2@2ch)",null,null,"-","",{"$f":"VLOOKUP(F342,A:B,2,0)","v":{"$error":"#N/A"}},"#EXTINF:-1 tvg-name=\"百视通体育直播室6\",百视通体育直播室6"]
["239.253.43.53:5146","HD (V: h264; A: mp2@2ch)",null,null,"239.253.43.118:5146","239.253.43.118:5146",{"$f":"VLOOKUP(F343,A:B,2,0)","v":"SD (V: h264; A: mp2@2ch)"},"http://faim.top:12306/rtp/239.253.43.118:5146"]
["239.253.43.54:5146","HD (V: h264; A: mp2@2ch)",null,null,"-","",{"$f":"VLOOKUP(F344,A:B,2,0)","v":{"$error":"#N/A"}},"#EXTINF:-1 tvg-name=\"百视通体育直播室7\",百视通体育直播室7"]
["239.253.43.55:5146","HD (V: h264; A: mp2@2ch)",null,null,"239.253.43.119:5146","239.253.43.119:5146",{"$f":"VLOOKUP(F345,A:B,2,0)","v":"SD (V: h264; A: mp2@2ch)"},"http://faim.top:12306/rtp/239.253.43.119:5146"]
["239.253.43.56:5146","HD (V: h264; A: mp2@2ch)",null,null,"-","",{"$f":"VLOOKUP(F346,A:B,2,0)","v":{"$error":"#N/A"}},"#EXTINF:-1 tvg-name=\"天元围棋\",天元围棋"]
["239.253.43.57:5146","HD (V: h264; A: mp2@2ch)",null,null,"239.253.43.98:5146","239.253.43.98:5146",{"$f":"VLOOKUP(F347,A:B,2,0)","v":"HD (V: h264; A: mp2@2ch)"},"http://faim.top:12306/rtp/239.253.43.98:5146"]
["239.253.43.62:5146","HD (V: h264; A: mp2@2ch)",null,null,"-","",{"$f":"VLOOKUP(F348,A:B,2,0)","v":{"$error":"#N/A"}},"#EXTINF:-1 tvg-name=\"汽摩\",汽摩"]
["239.253.43.63:5146","HD (V: h264; A: mp2@2ch)",null,null,"239.77.0.209:5146","239.77.0.209:5146",{"$f":"VLOOKUP(F349,A:B,2,0)","v":"SD (V: h264; A: mp2@1ch)"},"http://faim.top:12306/rtp/239.77.0.209:5146"]
["239.253.43.70:5146","HD (V: h264; A: mp2@2ch)",null,null,"-","",{"$f":"VLOOKUP(F350,A:B,2,0)","v":{"$error":"#N/A"}},"#EXTINF:-1 tvg-name=\"老故事\",老故事"]
["239.253.43.71:5146","HD (V: h264; A: mp2@2ch)",null,null,"239.77.0.220:5146","239.77.0.220:5146",{"$f":"VLOOKUP(F351,A:B,2,0)","v":"SD (V: h264; A: mp2@1ch)"},"http://faim.top:12306/rtp/239.77.0.220:5146"]
["239.253.43.72:5146","HD (V: h264; A: mp2@2ch)",null,null,"-","",{"$f":"VLOOKUP(F352,A:B,2,0)","v":{"$error":"#N/A"}},"#EXTINF:-1 tvg-name=\"国学\",国学"]
["239.253.43.73:5146","HD (V: h264; A: mp2@2ch)",null,null,"239.77.0.226:5146","239.77.0.226:5146",{"$f":"VLOOKUP(F353,A:B,2,0)","v":"SD (V: h264; A: mp2@1ch)"},"http://faim.top:12306/rtp/239.77.0.226:5146"]
["239.253.43.74:5146","HD (V: h264; A: mp2@2ch)",null,null,"-","",{"$f":"VLOOKUP(F354,A:B,2,0)","v":{"$error":"#N/A"}},"#EXTINF:-1 tvg-name=\"兵器科技高清\",兵器科技高清"]
["239.253.43.75:5146","HD (V: h264; A: mp2@2ch)",null,null,"239.253.43.18:5146","239.253.43.18:5146",{"$f":"VLOOKUP(F355,A:B,2,0)","v":"HD (V: h264; A: mp2@2ch)"},"http://faim.top:12306/rtp/239.253.43.18:5146"]
["239.253.43.82:5146","HD (V: h264; A: mp2@2ch)",null,null,"-","",{"$f":"VLOOKUP(F356,A:B,2,0)","v":{"$error":"#N/A"}},"#EXTINF:-1 tvg-name=\"电视指南高清\",电视指南高清"]
["239.253.43.83:5146","HD (V: h264; A: mp2@2ch)",null,null,"239.253.43.19:5146","239.253.43.19:5146",{"$f":"VLOOKUP(F357,A:B,2,0)","v":"HD (V: h264; A: mp2@2ch)"},"http://faim.top:12306/rtp/239.253.43.19:5146"]
["239.253.43.98:5146","HD (V: h264; A: mp2@2ch)",null,null,"-","",{"$f":"VLOOKUP(F358,A:B,2,0)","v":{"$error":"#N/A"}},"#EXTINF:-1 tvg-name=\"风云足球高清\",风云足球高清"]
["239.253.43.99:5146","4K (V: hevc; A: aac@2ch)",null,null,"239.253.43.20:5146","239.253.43.20:5146",{"$f":"VLOOKUP(F359,A:B,2,0)","v":"HD (V: h264; A: mp2@2ch)"},"http://faim.top:12306/rtp/239.253.43.20:5146"]
["239.253.43.100:5146","HD (V: h264; A: mp2@2ch)",null,null,"-","",{"$f":"VLOOKUP(F360,A:B,2,0)","v":{"$error":"#N/A"}},"#EXTINF:-1 tvg-name=\"央视台球高清\",央视台球高清"]
["239.253.43.101:5146","HD (V: h264; A: mp2@2ch)",null,null,"239.253.43.21:5146","239.253.43.21:5146",{"$f":"VLOOKUP(F361,A:B,2,0)","v":"HD (V: h264; A: mp2@2ch)"},"http://faim.top:12306/rtp/239.253.43.21:5146"]
["239.253.43.104:5146","HD (V: h264; A: mp2@2ch)",null,null,"-","",{"$f":"VLOOKUP(F362,A:B,2,0)","v":{"$error":"#N/A"}},"#EXTINF:-1 tvg-name=\"高尔夫网球高清\",高尔夫网球高清"]
["239.253.43.105:5146","HD (V: h264; A: mp2@2ch)",null,null,"239.253.43.22:5146","239.253.43.22:5146",{"$f":"VLOOKUP(F363,A:B,2,0)","v":"HD (V: h264; A: mp2@2ch)"},"http://faim.top:12306/rtp/239.253.43.22:5146"]
["239.253.43.113:5146","HD (V: h264; A: mp2@2ch)",null,null,"-","",{"$f":"VLOOKUP(F364,A:B,2,0)","v":{"$error":"#N/A"}},"#EXTINF:-1 tvg-name=\"女性时尚高清\",女性时尚高清"]
["239.253.43.114:5146","HD (V: h264; A: mp2@2ch)",null,null,"239.253.43.23:5146","239.253.43.23:5146",{"$f":"VLOOKUP(F365,A:B,2,0)","v":"HD (V: h264; A: mp2@2ch)"},"http://faim.top:12306/rtp/239.253.43.23:5146"]
["239.253.43.115:5146","SD (V: h264; A: mp2@2ch)",null,null,"-","",{"$f":"VLOOKUP(F366,A:B,2,0)","v":{"$error":"#N/A"}},"#EXTINF:-1 tvg-name=\"世界地理高清\",世界地理高清"]
["239.253.43.116:5146","SD (V: h264; A: mp2@2ch)",null,null,"239.253.43.24:5146","239.253.43.24:5146",{"$f":"VLOOKUP(F367,A:B,2,0)","v":"HD (V: h264; A: mp2@2ch)"},"http://faim.top:12306/rtp/239.253.43.24:5146"]
["239.253.43.117:5146","SD (V: h264; A: mp2@2ch)",null,null,"-","",{"$f":"VLOOKUP(F368,A:B,2,0)","v":{"$error":"#N/A"}},"#EXTINF:-1 tvg-name=\"怀旧剧场高清\",怀旧剧场高清"]
["239.253.43.118:5146","SD (V: h264; A: mp2@2ch)",null,null,"239.253.43.25:5146","239.253.43.25:5146",{"$f":"VLOOKUP(F369,A:B,2,0)","v":"HD (V: h264; A: mp2@2ch)"},"http://faim.top:12306/rtp/239.253.43.25:5146"]
["239.253.43.119:5146","SD (V: h264; A: mp2@2ch)",null,null,"-","",{"$f":"VLOOKUP(F370,A:B,2,0)","v":{"$error":"#N/A"}},"#EXTINF:-1 tvg-name=\"风云剧场高清\",风云剧场高清"]
["239.253.43.120:5146","HD (V: h264; A: mp2@2ch)",null,null,"239.253.43.26:5146","239.253.43.26:5146",{"$f":"VLOOKUP(F371,A:B,2,0)","v":"HD (V: h264; A: mp2@2ch)"},"http://faim.top:12306/rtp/239.253.43.26:5146"]
["239.253.43.121:5146","HD (V: h264; A: mp2@2ch)",null,null,"-","",{"$f":"VLOOKUP(F372,A:B,2,0)","v":{"$error":"#N/A"}},"#EXTINF:-1 tvg-name=\"央视精品高清\",央视精品高清"]
["239.253.43.122:5146","HD (V: h264; A: mp2@2ch)",null,null,"239.253.43.27:5146","239.253.43.27:5146",{"$f":"VLOOKUP(F373,A:B,2,0)","v":"HD (V: h264; A: mp2@2ch)"},"http://faim.top:12306/rtp/239.253.43.27:5146"]
["239.253.43.123:5146","HD (V: h264; A: mp2@2ch)",null,null,"-","",{"$f":"VLOOKUP(F374,A:B,2,0)","v":{"$error":"#N/A"}},"#EXTINF:-1 tvg-name=\"第一剧场高清\",第一剧场高清"]
["239.253.43.124:5146","HD (V: h264; A: mp2@2ch)",null,null,"239.253.43.28:5146","239.253.43.28:5146",{"$f":"VLOOKUP(F375,A:B,2,0)","v":"HD (V: h264; A: mp2@2ch)"},"http://faim.top:12306/rtp/239.253.43.28:5146"]
["239.253.43.125:5146","HD (V: h264; A: mp2@2ch)",null,null,"-","",{"$f":"VLOOKUP(F376,A:B,2,0)","v":{"$error":"#N/A"}},"#EXTINF:-1 tvg-name=\"风云音乐高清\",风云音乐高清"]
["239.253.43.126:5146","SD (V: h264; A: mp2@1ch)",null,null,"239.253.43.29:5146","239.253.43.29:5146",{"$f":"VLOOKUP(F377,A:B,2,0)","v":"HD (V: h264; A: mp2@2ch)"},"http://faim.top:12306/rtp/239.253.43.29:5146"]
["239.253.43.127:5146","SD (V: h264; A: mp2@1ch)",null,null,"-","",{"$f":"VLOOKUP(F378,A:B,2,0)","v":{"$error":"#N/A"}},"#EXTINF:-1 tvg-name=\"早期教育高清\",早期教育高清"]
["239.253.43.165:5146","SD (V: h264; A: aac@2ch)",null,null,"239.77.0.180:5146","239.77.0.180:5146",{"$f":"VLOOKUP(F379,A:B,2,0)","v":"HD (V: h264; A: mp2@2ch)"},"http://faim.top:12306/rtp/239.77.0.180:5146"]
["239.253.43.196:5146","HD (V: h264; A: mp2@2ch)",null,null,"-","",{"$f":"VLOOKUP(F380,A:B,2,0)","v":{"$error":"#N/A"}},"#EXTINF:-1 tvg-name=\"PPTV-1\",PPTV-1"]
["239.253.43.200:5146","HD (V: h264; A: mp2@2ch)",null,null,"239.77.1.183:5146","239.77.1.183:5146",{"$f":"VLOOKUP(F381,A:B,2,0)","v":"SD (V: h264; A: mp2@2ch)"},"http://faim.top:12306/rtp/239.77.1.183:5146"]
["239.253.43.201:5146","HD (V: h264; A: mp2@2ch)",null,null,"-","",{"$f":"VLOOKUP(F382,A:B,2,0)","v":{"$error":"#N/A"}},"#EXTINF:-1 tvg-name=\"PPTV-2\",PPTV-2"]
["239.253.43.213:5146","HD (V: h264; A: mp2@2ch)",null,null,"239.77.1.184:5146","239.77.1.184:5146",{"$f":"VLOOKUP(F383,A:B,2,0)","v":"SD (V: h264; A: mp2@2ch)"},"http://faim.top:12306/rtp/239.77.1.184:5146"]
["239.253.43.214:5146","HD (V: h264; A: mp2@2ch)",null,null,"-","",{"$f":"VLOOKUP(F384,A:B,2,0)","v":{"$error":"#N/A"}},"#EXTINF:-1 tvg-name=\"PPTV-3\",PPTV-3"]
[null,null,null,null,{"$f":"IFERROR(VLOOKUP(F385,A:A,1,0),\"-\")","v":"-"},"239.77.1.185:5146",{"$f":"VLOOKUP(F385,A:B,2,0)","v":{"$error":"#N/A"}},"http://faim.top:12306/rtp/239.77.1.185:5146"]
[null,null,null,null,"-","",{"$error":"#N/A"},"#EXTINF:-1 tvg-name=\"PPTV-4\",PPTV-4"]
[null,null,null,null,"-",{"$f":"IF(LEFT(H387,1)=\"#\",\"\",MID(H387,FIND(\"rtp\",H387)+4,LEN(H387)-FIND(\"rtp\",H387)-3))","v":"239.77.1.186:5146"},{"$error":"#N/A"},"http://faim.top:12306/rtp/239.77.1.186:5146"]
[null,null,null,null,"-","",{"$error":"#N/A"},"#EXTINF:-1 tvg-name=\"精选频道2\",精选频道2"]
[null,null,null,null,"239.77.0.185:5146","239.77.0.185:5146","HD (V: h264; A: mp2@2ch)","http://faim.top:12306/rtp/239.77.0.185:5146"]
[null,null,null,null,"-","",{"$error":"#N/A"},"#EXTINF:-1 tvg-name=\"CCTV-1高清4M\",CCTV-1高清4M"]
[null,null,null,null,"239.77.0.119:5146","239.77.0.119:5146","HD (V: h264; A: mp2@2ch)","http://faim.top:12306/rtp/239.77.0.119:5146"]
[null,null,null,null,"-","",{"$error":"#N/A"},"#EXTINF:-1 tvg-name=\"九频同播频道\",九频同播频道"]
[null,null,null,null,"-","239.0.10.115:5115",{"$error":"#N/A"},"http://faim.top:12306/rtp/239.0.10.115:5115"]
[null,null,null,null,"-","",{"$error":"#N/A"},"#EXTINF:-1 tvg-name=\"CCTV1-1M开机标清\",CCTV1-1M开机标清"]
[null,null,null,null,"239.77.0.14:5146","239.77.0.14:5146","SD (V: h264; A: mp2@2ch)","http://faim.top:12306/rtp/239.77.0.14:5146"]
[null,null,null,null,"-",{"$error":"#VALUE!"},{"$error":"#VALUE!"}]
[null,null,null,null,"-",{"$error":"#VALUE!"},{"$error":"#VALUE!"}]
[null,null,null,null,"-",{"$error":"#VALUE!"},{"$error":"#VALUE!"}]
[null,null,null,null,"-",{"$error":"#VALUE!"},{"$error":"#VALUE!"}]
[null,null,null,null,"-",{"$error":"#VALUE!"},{"$error":"#VALUE!"}]
[null,null,null,null,"-",{"$error":"#VALUE!"},{"$error":"#VALUE!"}]
[null,null,null,null,"-",{"$error":"#VALUE!"},{"$error":"#VALUE!"}]
[null,null,null,null,"-",{"$error":"#VALUE!"},{"$error":"#VALUE!"}]
[null,null,null,null,"-",{"$error":"#VALUE!"},{"$error":"#VALUE!"}]
[null,null,null,null,"-",{"$error":"#VALUE!"},{"$error":"#VALUE!"}]
[null,null,null,null,"-",{"$error":"#VALUE!"},{"$error":"#VALUE!"}]
[null,null,null,null,"-",{"$error":"#VALUE!"},{"$error":"#VALUE!"}]
[null,null,null,null,"-",{"$error":"#VALUE!"},{"$error":"#VALUE!"}]
[null,null,null,null,"-",{"$error":"#VALUE!"},{"$error":"#VALUE!"}]
[null,null,null,null,"-",{"$error":"#VALUE!"},{"$error":"#VALUE!"}]
[null,null,null,null,"-",{"$error":"#VALUE!"},{"$error":"#VALUE!"}]
[null,null,null,null,"-",{"$error":"#VALUE!"},{"$error":"#VALUE!"}]
[null,null,null,null,"-",{"$error":"#VALUE!"},{"$error":"#VALUE!"}]
[null,null,null,null,"-",{"$error":"#VALUE!"},{"$error":"#VALUE!"}]
[null,null,null,null,"-",{"$error":"#VALUE!"},{"$error":"#VALUE!"}]
[null,null,null,null,"-",{"$error":"#VALUE!"},{"$error":"#VALUE!"}]
[null,null,null,null,"-",{"$error":"#VALUE!"},{"$error":"#VALUE!"}]
[null,null,null,null,"-",{"$error":"#VALUE!"},{"$error":"#VALUE!"}]
[null,null,null,null,"-",{"$error":"#VALUE!"},{"$error":"#VALUE!"}]
[null,null,null,null,"-",{"$error":"#VALUE!"},{"$error":"#VALUE!"}]
[null,null,null,null,"-",{"$error":"#VALUE!"},{"$error":"#VALUE!"}]
[null,null,null,null,"-",{"$error":"#VALUE!"},{"$error":"#VALUE!"}]
[null,null,null,null,"-",{"$error":"#VALUE!"},{"$error":"#VALUE!"}]
[null,null,null,null,"-",{"$error":"#VALUE!"},{"$error":"#VALUE!"}]
[null,null,null,null,"-",{"$error":"#VALUE!"},{"$error":"#VALUE!"}]
[null,null,null,null,"-",{"$error":"#VALUE!"},{"$error":"#VALUE!"}]
[null,null,null,null,"-",{"$error":"#VALUE!"},{"$error":"#VALUE!"}]
[null,null,null,null,"-",{"$error":"#VALUE!"},{"$error":"#VALUE!"}]
[null,null,null,null,"-",{"$error":"#VALUE!"},{"$error":"#VALUE!"}]
[null,null,null,null,"-",{"$error":"#VALUE!"},{"$error":"#VALUE!"}]
[null,null,null,null,"-",{"$error":"#VALUE!"},{"$error":"#VALUE!"}]
[null,null,null,null,"-",{"$error":"#VALUE!"},{"$error":"#VALUE!"}]
[null,null,null,null,"-",{"$error":"#VALUE!"},{"$error":"#VALUE!"}]
[null,null,null,null,"-",{"$error":"#VALUE!"},{"$error":"#VALUE!"}]
[null,null,null,null,"-",{"$error":"#VALUE!"},{"$error":"#VALUE!"}]
[null,null,null,null,"-",{"$error":"#VALUE!"},{"$error":"#VALUE!"}]
[null,null,null,null,"-",{"$error":"#VALUE!"},{"$error":"#VALUE!"}]
[null,null,null,null,"-",{"$error":"#VALUE!"},{"$error":"#VALUE!"}]
[null,null,null,null,"-",{"$error":"#VALUE!"},{"$error":"#VALUE!"}]
[null,null,null,null,"-",{"$error":"#VALUE!"},{"$error":"#VALUE!"}]
[null,null,null,null,"-",{"$error":"#VALUE!"},{"$error":"#VALUE!"}]
[null,null,null,null,"-",{"$error":"#VALUE!"},{"$error":"#VALUE!"}]
[null,null,null,null,"-",{"$error":"#VALUE!"},{"$error":"#VALUE!"}]
[null,null,null,null,"-",{"$error":"#VALUE!"},{"$error":"#VALUE!"}]
[null,null,null,null,"-",{"$error":"#VALUE!"},{"$error":"#VALUE!"}]
[null,null,null,null,"-",{"$error":"#VALUE!"},{"$error":"#VALUE!"}]
[null,null,null,null,"-",{"$error":"#VALUE!"},{"$error":"#VALUE!"}]
[null,null,null,null,"-",{"$error":"#VALUE!"},{"$error":"#VALUE!"}]
[null,null,null,null,{"$f":"IFERROR(VLOOKUP(F449,A:A,1,0),\"-\")","v":"-"},{"$error":"#VALUE!"},{"$f":"VLOOKUP(F449,A:B,2,0)","v":{"$error":"#VALUE!"}}]
[null,null,null,null,"-",{"$error":"#VALUE!"},{"$error":"#VALUE!"}]
[null,null,null,null,"-",{"$f":"IF(LEFT(H451,1)=\"#\",\"\",MID(H451,FIND(\"rtp\",H451)+4,LEN(H451)-FIND(\"rtp\",H451)-3))","v":{"$error":"#VALUE!"}},{"$error":"#VALUE!"}]
[null,null,null,null,"-",{"$error":"#VALUE!"},{"$error":"#VALUE!"}]
[null,null,null,null,"-",{"$error":"#VALUE!"},{"$error":"#VALUE!"}]
[null,null,null,null,"-",{"$error":"#VALUE!"},{"$error":"#VALUE!"}]
[null,null,null,null,"-",{"$error":"#VALUE!"},{"$error":"#VALUE!"}]
[null,null,null,null,"-",{"$error":"#VALUE!"},{"$error":"#VALUE!"}]
[null,null,null,null,"-",{"$error":"#VALUE!"},{"$error":"#VALUE!"}]
[null,null,null,null,"-",{"$error":"#VALUE!"},{"$error":"#VALUE!"}]
[null,null,null,null,"-",{"$error":"#VALUE!"},{"$error":"#VALUE!"}]
[null,null,null,null,"-",{"$error":"#VALUE!"},{"$error":"#VALUE!"}]
[null,null,null,null,"-",{"$error":"#VALUE!"},{"$error":"#VALUE!"}]
[null,null,null,null,"-",{"$error":"#VALUE!"},{"$error":"#VALUE!"}]
[null,null,null,null,"-",{"$error":"#VALUE!"},{"$error":"#VALUE!"}]
[null,null,null,null,"-",{"$error":"#VALUE!"},{"$error":"#VALUE!"}]
[null,null,null,null,"-",{"$error":"#VALUE!"},{"$error":"#VALUE!"}]
[null,null,null,null,"-",{"$error":"#VALUE!"},{"$error":"#VALUE!"}]
[null,null,null,null,"-",{"$error":"#VALUE!"},{"$error":"#VALUE!"}]
[null,null,null,null,"-",{"$error":"#VALUE!"},{"$error":"#VALUE!"}]
[null,null,null,null,"-",{"$error":"#VALUE!"},{"$error":"#VALUE!"}]
[null,null,null,null,"-",{"$error":"#VALUE!"},{"$error":"#VALUE!"}]
[null,null,null,null,"-",{"$error":"#VALUE!"},{"$error":"#VALUE!"}]
[null,null,null,null,"-",{"$error":"#VALUE!"},{"$error":"#VALUE!"}]
[null,null,null,null,"-",{"$error":"#VALUE!"},{"$error":"#VALUE!"}]
[null,null,null,null,"-",{"$error":"#VALUE!"},{"$error":"#VALUE!"}]
[null,null,null,null,"-",{"$error":"#VALUE!"},{"$error":"#VALUE!"}]
[null,null,null,null,"-",{"$error":"#VALUE!"},{"$error":"#VALUE!"}]
[null,null,null,null,"-",{"$error":"#VALUE!"},{"$error":"#VALUE!"}]
[null,null,null,null,"-",{"$error":"#VALUE!"},{"$error":"#VALUE!"}]
[null,null,null,null,"-",{"$error":"#VALUE!"},{"$error":"#VALUE!"}]
[null,null,null,null,"-",{"$error":"#VALUE!"},{"$error":"#VALUE!"}]
[null,null,null,null,"-",{"$error":"#VALUE!"},{"$error":"#VALUE!"}]
[null,null,null,null,"-",{"$error":"#VALUE!"},{"$error":"#VALUE!"}]
[null,null,null,null,"-",{"$error":"#VALUE!"},{"$error":"#VALUE!"}]
[null,null,null,null,"-",{"$error":"#VALUE!"},{"$error":"#VALUE!"}]
[null,null,null,null,"-",{"$error":"#VALUE!"},{"$error":"#VALUE!"}]
[null,null,null,null,"-",{"$error":"#VALUE!"},{"$error":"#VALUE!"}]
[null,null,null,null,"-",{"$error":"#VALUE!"},{"$error":"#VALUE!"}]
[null,null,null,null,"-",{"$error":"#VALUE!"},{"$error":"#VALUE!"}]
[null,null,null,null,"-",{"$error":"#VALUE!"},{"$error":"#VALUE!"}]
[null,null,null,null,"-",{"$error":"#VALUE!"},{"$error":"#VALUE!"}]
[null,null,null,null,"-",{"$error":"#VALUE!"},{"$error":"#VALUE!"}]
[null,null,null,null,"-",{"$error":"#VALUE!"},{"$error":"#VALUE!"}]
[null,null,null,null,"-",{"$error":"#VALUE!"},{"$error":"#VALUE!"}]
[null,null,null,null,"-",{"$error":"#VALUE!"},{"$error":"#VALUE!"}]
[null,null,null,null,"-",{"$error":"#VALUE!"},{"$error":"#VALUE!"}]
[null,null,null,null,"-",{"$error":"#VALUE!"},{"$error":"#VALUE!"}]
[null,null,null,null,"-",{"$error":"#VALUE!"},{"$error":"#VALUE!"}]
[null,null,null,null,"-",{"$error":"#VALUE!"},{"$error":"#VALUE!"}]
[null,null,null,null,"-",{"$error":"#VALUE!"},{"$error":"#VALUE!"}]
[null,null,null,null,"-",{"$error":"#VALUE!"},{"$error":"#VALUE!"}]
[null,null,null,null,"-",{"$error":"#VALUE!"},{"$error":"#VALUE!"}]
[null,null,null,null,"-",{"$error":"#VALUE!"},{"$error":"#VALUE!"}]
[null,null,null,null,"-",{"$error":"#VALUE!"},{"$error":"#VALUE!"}]
[null,null,null,null,"-",{"$error":"#VALUE!"},{"$error":"#VALUE!"}]
[null,null,null,null,"-",{"$error":"#VALUE!"},{"$error":"#VALUE!"}]
[null,null,null,null,"-",{"$error":"#VALUE!"},{"$error":"#VALUE!"}]
[null,null,null,null,"-",{"$error":"#VALUE!"},{"$error":"#VALUE!"}]
[null,null,null,null,"-",{"$error":"#VALUE!"},{"$error":"#VALUE!"}]
[null,null,null,null,"-",{"$error":"#VALUE!"},{"$error":"#VALUE!"}]
[null,null,null,null,"-",{"$error":"#VALUE!"},{"$error":"#VALUE!"}]
[null,null,null,null,"-",{"$error":"#VALUE!"},{"$error":"#VALUE!"}]
[null,null,null,null,"-",{"$error":"#VALUE!"},{"$error":"#VALUE!"}]
[null,null,null,null,{"$f":"IFERROR(VLOOKUP(F513,A:A,1,0),\"-\")","v":"-"},{"$error":"#VALUE!"},{"$f":"VLOOKUP(F513,A:B,2,0)","v":{"$error":"#VALUE!"}}]
[null,null,null,null,"-",{"$error":"#VALUE!"},{"$error":"#VALUE!"}]
[null,null,null,null,"-",{"$f":"IF(LEFT(H515,1)=\"#\",\"\",MID(H515,FIND(\"rtp\",H515)+4,LEN(H515)-FIND(\"rtp\",H515)-3))","v":{"$error":"#VALUE!"}},{"$error":"#VALUE!"}]
[null,null,null,null,"-",{"$error":"#VALUE!"},{"$error":"#VALUE!"}]
[null,null,null,null,"-",{"$error":"#VALUE!"},{"$error":"#VALUE!"}]
[null,null,null,null,"-",{"$error":"#VALUE!"},{"$error":"#VALUE!"}]
[null,null,null,null,"-",{"$error":"#VALUE!"},{"$error":"#VALUE!"}]
[null,null,null,null,"-",{"$error":"#VALUE!"},{"$error":"#VALUE!"}]
[null,null,null,null,"-",{"$error":"#VALUE!"},{"$error":"#VALUE!"}]
[null,null,null,null,"-",{"$error":"#VALUE!"},{"$error":"#VALUE!"}]
[null,null,null,null,"-",{"$error":"#VALUE!"},{"$error":"#VALUE!"}]
[null,null,null,null,"-",{"$error":"#VALUE!"},{"$error":"#VALUE!"}]
[null,null,null,null,"-",{"$error":"#VALUE!"},{"$error":"#VALUE!"}]
[null,null,null,null,"-",{"$error":"#VALUE!"},{"$error":"#VALUE!"}]
[null,null,null,null,"-",{"$error":"#VALUE!"},{"$error":"#VALUE!"}]
[null,null,null,null,"-",{"$error":"#VALUE!"},{"$error":"#VALUE!"}]
[null,null,null,null,"-",{"$error":"#VALUE!"},{"$error":"#VALUE!"}]
[null,null,null,null,"-",{"$error":"#VALUE!"},{"$error":"#VALUE!"}]
[null,null,null,null,"-",{"$error":"#VALUE!"},{"$error":"#VALUE!"}]
[null,null,null,null,"-",{"$error":"#VALUE!"},{"$error":"#VALUE!"}]
[null,null,null,null,"-",{"$error":"#VALUE!"},{"$error":"#VALUE!"}]
[null,null,null,null,"-",{"$error":"#VALUE!"},{"$error":"#VALUE!"}]
[null,null,null,null,"-",{"$error":"#VALUE!"},{"$error":"#VALUE!"}]
[null,null,null,null,"-",{"$error":"#VALUE!"},{"$error":"#VALUE!"}]
[null,null,null,null,"-",{"$error":"#VALUE!"},{"$error":"#VALUE!"}]
[null,null,null,null,"-",{"$error":"#VALUE!"},{"$error":"#VALUE!"}]
[null,null,null,null,"-",{"$error":"#VALUE!"},{"$error":"#VALUE!"}]
[null,null,null,null,"-",{"$error":"#VALUE!"},{"$error":"#VALUE!"}]
[null,null,null,null,"-",{"$error":"#VALUE!"},{"$error":"#VALUE!"}]
[null,null,null,null,"-",{"$error":"#VALUE!"},{"$error":"#VALUE!"}]
[null,null,null,null,"-",{"$error":"#VALUE!"},{"$error":"#VALUE!"}]
[null,null,null,null,"-",{"$error":"#VALUE!"},{"$error":"#VALUE!"}]
[null,null,null,null,"-",{"$error":"#VALUE!"},{"$error":"#VALUE!"}]
[null,null,null,null,"-",{"$error":"#VALUE!"},{"$error":"#VALUE!"}]
[null,null,null,null,"-",{"$error":"#VALUE!"},{"$error":"#VALUE!"}]
[null,null,null,null,"-",{"$error":"#VALUE!"},{"$error":"#VALUE!"}]
[null,null,null,null,"-",{"$error":"#VALUE!"},{"$error":"#VALUE!"}]
[null,null,null,null,"-",{"$error":"#VALUE!"},{"$error":"#VALUE!"}]
[null,null,null,null,"-",{"$error":"#VALUE!"},{"$error":"#VALUE!"}]
[null,null,null,null,"-",{"$error":"#VALUE!"},{"$error":"#VALUE!"}]
[null,null,null,null,"-",{"$error":"#VALUE!"},{"$error":"#VALUE!"}]
[null,null,null,null,"-",{"$error":"#VALUE!"},{"$error":"#VALUE!"}]
[null,null,null,null,"-",{"$error":"#VALUE!"},{"$error":"#VALUE!"}]
[null,null,null,null,"-",{"$error":"#VALUE!"},{"$error":"#VALUE!"}]
[null,null,null,null,"-",{"$error":"#VALUE!"},{"$error":"#VALUE!"}]
[null,null,null,null,"-",{"$error":"#VALUE!"},{"$error":"#VALUE!"}]
[null,null,null,null,"-",{"$error":"#VALUE!"},{"$error":"#VALUE!"}]
[null,null,null,null,"-",{"$error":"#VALUE!"},{"$error":"#VALUE!"}]
[null,null,null,null,"-",{"$error":"#VALUE!"},{"$error":"#VALUE!"}]
[null,null,null,null,"-",{"$error":"#VALUE!"},{"$error":"#VALUE!"}]
[null,null,null,null,"-",{"$error":"#VALUE!"},{"$error":"#VALUE!"}]
[null,null,null,null,"-",{"$error":"#VALUE!"},{"$error":"#VALUE!"}]
[null,null,null,null,"-",{"$error":"#VALUE!"},{"$error":"#VALUE!"}]
[null,null,null,null,"-",{"$error":"#VALUE!"},{"$error":"#VALUE!"}]
[null,null,null,null,"-",{"$error":"#VALUE!"},{"$error":"#VALUE!"}]
[null,null,null,null,"-",{"$error":"#VALUE!"},{"$error":"#VALUE!"}]
[null,null,null,null,"-",{"$error":"#VALUE!"},{"$error":"#VALUE!"}]
[null,null,null,null,"-",{"$error":"#VALUE!"},{"$error":"#VALUE!"}]
[null,null,null,null,"-",{"$error":"#VALUE!"},{"$error":"#VALUE!"}]
[null,null,null,null,"-",{"$error":"#VALUE!"},{"$error":"#VALUE!"}]
[null,null,null,null,"-",{"$error":"#VALUE!"},{"$error":"#VALUE!"}]
[null,null,null,null,"-",{"$error":"#VALUE!"},{"$error":"#VALUE!"}]
[null,null,null,null,"-",{"$error":"#VALUE!"},{"$error":"#VALUE!"}]
[null,null,null,null,"-",{"$error":"#VALUE!"},{"$error":"#VALUE!"}]
[null,null,null,null,{"$f":"IFERROR(VLOOKUP(F577,A:A,1,0),\"-\")","v":"-"},{"$error":"#VALUE!"},{"$f":"VLOOKUP(F577,A:B,2,0)","v":{"$error":"#VALUE!"}}]
[null,null,null,null,"-",{"$error":"#VALUE!"},{"$error":"#VALUE!"}]
[null,null,null,null,"-",{"$f":"IF(LEFT(H579,1)=\"#\",\"\",MID(H579,FIND(\"rtp\",H579)+4,LEN(H579)-FIND(\"rtp\",H579)-3))","v":{"$error":"#VALUE!"}},{"$error":"#VALUE!"}]
[null,null,null,null,"-",{"$error":"#VALUE!"},{"$error":"#VALUE!"}]
[null,null,null,null,"-",{"$error":"#VALUE!"},{"$error":"#VALUE!"}]
[null,null,null,null,"-",{"$error":"#VALUE!"},{"$error":"#VALUE!"}]
[null,null,null,null,"-",{"$error":"#VALUE!"},{"$error":"#VALUE!"}]
[null,null,null,null,"-",{"$error":"#VALUE!"},{"$error":"#VALUE!"}]
[null,null,null,null,"-",{"$error":"#VALUE!"},{"$error":"#VALUE!"}]
[null,null,null,null,"-",{"$error":"#VALUE!"},{"$error":"#VALUE!"}]
[null,null,null,null,"-",{"$error":"#VALUE!"},{"$error":"#VALUE!"}]
[null,null,null,null,"-",{"$error":"#VALUE!"},{"$error":"#VALUE!"}]
[null,null,null,null,"-",{"$error":"#VALUE!"},{"$error":"#VALUE!"}]
[null,null,null,null,"-",{"$error":"#VALUE!"},{"$error":"#VALUE!"}]
[null,null,null,null,"-",{"$error":"#VALUE!"},{"$error":"#VALUE!"}]
[null,null,null,null,"-",{"$error":"#VALUE!"},{"$error":"#VALUE!"}]
[null,null,null,null,"-",{"$error":"#VALUE!"},{"$error":"#VALUE!"}]
[null,null,null,null,"-",{"$error":"#VALUE!"},{"$error":"#VALUE!"}]
[null,null,null,null,"-",{"$error":"#VALUE!"},{"$error":"#VALUE!"}]
[null,null,null,null,"-",{"$error":"#VALUE!"},{"$error":"#VALUE!"}]
[null,null,null,null,"-",{"$error":"#VALUE!"},{"$error":"#VALUE!"}]
[null,null,null,null,"-",{"$error":"#VALUE!"},{"$error":"#VALUE!"}]
[null,null,null,null,"-",{"$error":"#VALUE!"},{"$error":"#VALUE!"}]
[null,null,null,null,"-",{"$error":"#VALUE!"},{"$error":"#VALUE!"}]
[null,null,null,null,"-",{"$error":"#VALUE!"},{"$error":"#VALUE!"}]
[null,null,null,null,"-",{"$error":"#VALUE!"},{"$error":"#VALUE!"}]
[null,null,null,null,"-",{"$error":"#VALUE!"},{"$error":"#VALUE!"}]
[null,null,null,null,"-",{"$error":"#VALUE!"},{"$error":"#VALUE!"}]
[null,null,null,null,"-",{"$error":"#VALUE!"},{"$error":"#VALUE!"}]
[null,null,null,null,"-",{"$error":"#VALUE!"},{"$error":"#VALUE!"}]
[null,null,null,null,"-",{"$error":"#VALUE!"},{"$error":"#VALUE!"}]
[null,null,null,null,"-",{"$error":"#VALUE!"},{"$error":"#VALUE!"}]
[null,null,null,null,"-",{"$error":"#VALUE!"},{"$error":"#VALUE!"}]
[null,null,null,null,"-",{"$error":"#VALUE!"},{"$error":"#VALUE!"}]
[null,null,null,null,"-",{"$error":"#VALUE!"},{"$error":"#VALUE!"}]
[null,null,null,null,"-",{"$error":"#VALUE!"},{"$error":"#VALUE!"}]
[null,null,null,null,"-",{"$error":"#VALUE!"},{"$error":"#VALUE!"}]
[null,null,null,null,"-",{"$error":"#VALUE!"},{"$error":"#VALUE!"}]
[null,null,null,null,"-",{"$error":"#VALUE!"},{"$error":"#VALUE!"}]
[null,null,null,null,"-",{"$error":"#VALUE!"},{"$error":"#VALUE!"}]
[null,null,null,null,"-",{"$error":"#VALUE!"},{"$error":"#VALUE!"}]
[null,null,null,null,"-",{"$error":"#VALUE!"},{"$error":"#VALUE!"}]
[null,null,null,null,"-",{"$error":"#VALUE!"},{"$error":"#VALUE!"}]
[null,null,null,null,"-",{"$error":"#VALUE!"},{"$error":"#VALUE!"}]
[null,null,null,null,"-",{"$error":"#VALUE!"},{"$error":"#VALUE!"}]
[null,null,null,null,"-",{"$error":"#VALUE!"},{"$error":"#VALUE!"}]
[null,null,null,null,"-",{"$error":"#VALUE!"},{"$error":"#VALUE!"}]
[null,null,null,null,"-",{"$error":"#VALUE!"},{"$error":"#VALUE!"}]
[null,null,null,null,"-",{"$error":"#VALUE!"},{"$error":"#VALUE!"}]
[null,null,null,null,"-",{"$error":"#VALUE!"},{"$error":"#VALUE!"}]
[null,null,null,null,"-",{"$error":"#VALUE!"},{"$error":"#VALUE!"}]
[null,null,null,null,"-",{"$error":"#VALUE!"},{"$error":"#VALUE!"}]
[null,null,null,null,"-",{"$error":"#VALUE!"},{"$error":"#VALUE!"}]
[null,null,null,null,"-",{"$error":"#VALUE!"},{"$error":"#VALUE!"}]
[null,null,null,null,"-",{"$error":"#VALUE!"},{"$error":"#VALUE!"}]
[null,null,null,null,"-",{"$error":"#VALUE!"},{"$error":"#VALUE!"}]
[null,null,null,null,"-",{"$error":"#VALUE!"},{"$error":"#VALUE!"}]
[null,null,null,null,"-",{"$error":"#VALUE!"},{"$error":"#VALUE!"}]
[null,null,null,null,"-",{"$error":"#VALUE!"},{"$error":"#VALUE!"}]
[null,null,null,null,"-",{"$error":"#VALUE!"},{"$error":"#VALUE!"}]
[null,null,null,null,"-",{"$error":"#VALUE!"},{"$error":"#VALUE!"}]
[null,null,null,null,"-",{"$error":"#VALUE!"},{"$error":"#VALUE!"}]
[null,null,null,null,"-",{"$error":"#VALUE!"},{"$error":"#VALUE!"}]
[null,null,null,null,"-",{"$error":"#VALUE!"},{"$error":"#VALUE!"}]
[null,null,null,null,{"$f":"IFERROR(VLOOKUP(F641,A:A,1,0),\"-\")","v":"-"},{"$error":"#VALUE!"},{"$f":"VLOOKUP(F641,A:B,2,0)","v":{"$error":"#VALUE!"}}]
[null,null,null,null,"-",{"$error":"#VALUE!"},{"$error":"#VALUE!"}]
[null,null,null,null,"-",{"$f":"IF(LEFT(H643,1)=\"#\",\"\",MID(H643,FIND(\"rtp\",H643)+4,LEN(H643)-FIND(\"rtp\",H643)-3))","v":{"$error":"#VALUE!"}},{"$error":"#VALUE!"}]
[null,null,null,null,"-",{"$error":"#VALUE!"},{"$error":"#VALUE!"}]
[null,null,null,null,"-",{"$error":"#VALUE!"},{"$error":"#VALUE!"}]
[null,null,null,null,"-",{"$error":"#VALUE!"},{"$error":"#VALUE!"}]
[null,null,null,null,"-",{"$error":"#VALUE!"},{"$error":"#VALUE!"}]
[null,null,null,null,"-",{"$error":"#VALUE!"},{"$error":"#VALUE!"}]
[null,null,null,null,"-",{"$error":"#VALUE!"},{"$error":"#VALUE!"}]
[null,null,null,null,"-",{"$error":"#VALUE!"},{"$error":"#VALUE!"}]
[null,null,null,null,"-",{"$error":"#VALUE!"},{"$error":"#VALUE!"}]
[null,null,null,null,"-",{"$error":"#VALUE!"},{"$error":"#VALUE!"}]
[null,null,null,null,"-",{"$error":"#VALUE!"},{"$error":"#VALUE!"}]
[null,null,null,null,"-",{"$error":"#VALUE!"},{"$error":"#VALUE!"}]
[null,null,null,null,"-",{"$error":"#VALUE!"},{"$error":"#VALUE!"}]
[null,null,null,null,"-",{"$error":"#VALUE!"},{"$error":"#VALUE!"}]
[null,null,null,null,"-",{"$error":"#VALUE!"},{"$error":"#VALUE!"}]
[null,null,null,null,"-",{"$error":"#VALUE!"},{"$error":"#VALUE!"}]
[null,null,null,null,"-",{"$error":"#VALUE!"},{"$error":"#VALUE!"}]
[null,null,null,null,"-",{"$error":"#VALUE!"},{"$error":"#VALUE!"}]
[null,null,null,null,"-",{"$error":"#VALUE!"},{"$error":"#VALUE!"}]
[null,null,null,null,"-",{"$error":"#VALUE!"},{"$error":"#VALUE!"}]
[null,null,null,null,"-",{"$error":"#VALUE!"},{"$error":"#VALUE!"}]
[null,null,null,null,"-",{"$error":"#VALUE!"},{"$error":"#VALUE!"}]
[null,null,null,null,"-",{"$error":"#VALUE!"},{"$error":"#VALUE!"}]
[null,null,null,null,"-",{"$error":"#VALUE!"},{"$error":"#VALUE!"}]
[null,null,null,null,"-",{"$error":"#VALUE!"},{"$error":"#VALUE!"}]
[null,null,null,null,"-",{"$error":"#VALUE!"},{"$error":"#VALUE!"}]
[null,null,null,null,"-",{"$error":"#VALUE!"},{"$error":"#VALUE!"}]
[null,null,null,null,"-",{"$error":"#VALUE!"},{"$error":"#VALUE!"}]
[null,null,null,null,"-",{"$error":"#VALUE!"},{"$error":"#VALUE!"}]
[null,null,null,null,"-",{"$error":"#VALUE!"},{"$error":"#VALUE!"}]
[null,null,null,null,"-",{"$error":"#VALUE!"},{"$error":"#VALUE!"}]
[null,null,null,null,"-",{"$error":"#VALUE!"},{"$error":"#VALUE!"}]
[null,null,null,null,"-",{"$error":"#VALUE!"},{"$error":"#VALUE!"}]
[null,null,null,null,"-",{"$error":"#VALUE!"},{"$error":"#VALUE!"}]
[null,null,null,null,"-",{"$error":"#VALUE!"},{"$error":"#VALUE!"}]
[null,null,null,null,"-",{"$error":"#VALUE!"},{"$error":"#VALUE!"}]
[null,null,null,null,"-",{"$error":"#VALUE!"},{"$error":"#VALUE!"}]
[null,null,null,null,"-",{"$error":"#VALUE!"},{"$error":"#VALUE!"}]
[null,null,null,null,"-",{"$error":"#VALUE!"},{"$error":"#VALUE!"}]
[null,null,null,null,"-",{"$error":"#VALUE!"},{"$error":"#VALUE!"}]
[null,null,null,null,"-",{"$error":"#VALUE!"},{"$error":"#VALUE!"}]
[null,null,null,null,"-",{"$error":"#VALUE!"},{"$error":"#VALUE!"}]
[null,null,null,null,"-",{"$error":"#VALUE!"},{"$error":"#VALUE!"}]
[null,null,null,null,"-",{"$error":"#VALUE!"},{"$error":"#VALUE!"}]
[null,null,null,null,"-",{"$error":"#VALUE!"},{"$error":"#VALUE!"}]
[null,null,null,null,"-",{"$error":"#VALUE!"},{"$error":"#VALUE!"}]
[null,null,null,null,"-",{"$error":"#VALUE!"},{"$error":"#VALUE!"}]
[null,null,null,null,"-",{"$error":"#VALUE!"},{"$error":"#VALUE!"}]
[null,null,null,null,"-",{"$error":"#VALUE!"},{"$error":"#VALUE!"}]
[null,null,null,null,"-",{"$error":"#VALUE!"},{"$error":"#VALUE!"}]
[null,null,null,null,"-",{"$error":"#VALUE!"},{"$error":"#VALUE!"}]
[null,null,null,null,"-",{"$error":"#VALUE!"},{"$error":"#VALUE!"}]
[null,null,null,null,"-",{"$error":"#VALUE!"},{"$error":"#VALUE!"}]
[null,null,null,null,"-",{"$error":"#VALUE!"},{"$error":"#VALUE!"}]
[null,null,null,null,"-",{"$error":"#VALUE!"},{"$error":"#VALUE!"}]
[null,null,null,null,"-",{"$error":"#VALUE!"},{"$error":"#VALUE!"}]
[null,null,null,null,"-",{"$error":"#VALUE!"},{"$error":"#VALUE!"}]
[null,null,null,null,"-",{"$error":"#VALUE!"},{"$error":"#VALUE!"}]
[null,null,null,null,"-",{"$error":"#VALUE!"},{"$error":"#VALUE!"}]
[null,null,null,null,"-",{"$error":"#VALUE!"},{"$error":"#VALUE!"}]
[null,null,null,null,"-",{"$error":"#VALUE!"},{"$error":"#VALUE!"}]
[null,null,null,null,"-",{"$error":"#VALUE!"},{"$error":"#VALUE!"}]
[null,null,null,null,{"$f":"IFERROR(VLOOKUP(F705,A:A,1,0),\"-\")","v":"-"},{"$error":"#VALUE!"},{"$f":"VLOOKUP(F705,A:B,2,0)","v":{"$error":"#VALUE!"}}]
[null,null,null,null,"-",{"$error":"#VALUE!"},{"$error":"#VALUE!"}]
[null,null,null,null,"-",{"$f":"IF(LEFT(H707,1)=\"#\",\"\",MID(H707,FIND(\"rtp\",H707)+4,LEN(H707)-FIND(\"rtp\",H707)-3))","v":{"$error":"#VALUE!"}},{"$error":"#VALUE!"}]
[null,null,null,null,"-",{"$error":"#VALUE!"},{"$error":"#VALUE!"}]
[null,null,null,null,"-",{"$error":"#VALUE!"},{"$error":"#VALUE!"}]
[null,null,null,null,"-",{"$error":"#VALUE!"},{"$error":"#VALUE!"}]
[null,null,null,null,"-",{"$error":"#VALUE!"},{"$error":"#VALUE!"}]
[null,null,null,null,"-",{"$error":"#VALUE!"},{"$error":"#VALUE!"}]
[null,null,null,null,"-",{"$error":"#VALUE!"},{"$error":"#VALUE!"}]
[null,null,null,null,"-",{"$error":"#VALUE!"},{"$error":"#VALUE!"}]
[null,null,null,null,"-",{"$error":"#VALUE!"},{"$error":"#VALUE!"}]
[null,null,null,null,"-",{"$error":"#VALUE!"},{"$error":"#VALUE!"}]
[null,null,null,null,"-",{"$error":"#VALUE!"},{"$error":"#VALUE!"}]
[null,null,null,null,"-",{"$error":"#VALUE!"},{"$error":"#VALUE!"}]
[null,null,null,null,"-",{"$error":"#VALUE!"},{"$error":"#VALUE!"}]
[null,null,null,null,"-",{"$error":"#VALUE!"},{"$error":"#VALUE!"}]
[null,null,null,null,"-",{"$error":"#VALUE!"},{"$error":"#VALUE!"}]
[null,null,null,null,"-",{"$error":"#VALUE!"},{"$error":"#VALUE!"}]
[null,null,null,null,"-",{"$error":"#VALUE!"},{"$error":"#VALUE!"}]
[null,null,null,null,"-",{"$error":"#VALUE!"},{"$error":"#VALUE!"}]
[null,null,null,null,"-",{"$error":"#VALUE!"},{"$error":"#VALUE!"}]
[null,null,null,null,"-",{"$error":"#VALUE!"},{"$error":"#VALUE!"}]
[null,null,null,null,"-",{"$error":"#VALUE!"},{"$error":"#VALUE!"}]
[null,null,null,null,"-",{"$error":"#VALUE!"},{"$error":"#VALUE!"}]
[null,null,null,null,"-",{"$error":"#VALUE!"},{"$error":"#VALUE!"}]
[null,null,null,null,"-",{"$error":"#VALUE!"},{"$error":"#VALUE!"}]
[null,null,null,null,"-",{"$error":"#VALUE!"},{"$error":"#VALUE!"}]
[null,null,null,null,"-",{"$error":"#VALUE!"},{"$error":"#VALUE!"}]
[null,null,null,null,"-",{"$error":"#VALUE!"},{"$error":"#VALUE!"}]
[null,null,null,null,"-",{"$error":"#VALUE!"},{"$error":"#VALUE!"}]
[null,null,null,null,"-",{"$error":"#VALUE!"},{"$error":"#VALUE!"}]
[null,null,null,null,"-",{"$error":"#VALUE!"},{"$error":"#VALUE!"}]
[null,null,null,null,"-",{"$error":"#VALUE!"},{"$error":"#VALUE!"}]
[null,null,null,null,"-",{"$error":"#VALUE!"},{"$error":"#VALUE!"}]
[null,null,null,null,"-",{"$error":"#VALUE!"},{"$error":"#VALUE!"}]
[null,null,null,null,"-",{"$error":"#VALUE!"},{"$error":"#VALUE!"}]
[null,null,null,null,"-",{"$error":"#VALUE!"},{"$error":"#VALUE!"}]
[null,null,null,null,"-",{"$error":"#VALUE!"},{"$error":"#VALUE!"}]
[null,null,null,null,"-",{"$error":"#VALUE!"},{"$error":"#VALUE!"}]
[null,null,null,null,"-",{"$error":"#VALUE!"},{"$error":"#VALUE!"}]
[null,null,null,null,"-",{"$error":"#VALUE!"},{"$error":"#VALUE!"}]
[null,null,null,null,"-",{"$error":"#VALUE!"},{"$error":"#VALUE!"}]
[null,null,null,null,"-",{"$error":"#VALUE!"},{"$error":"#VALUE!"}]
[null,null,null,null,"-",{"$error":"#VALUE!"},{"$error":"#VALUE!"}]
[null,null,null,null,"-",{"$error":"#VALUE!"},{"$error":"#VALUE!"}]
[null,null,null,null,"-",{"$error":"#VALUE!"},{"$error":"#VALUE!"}]
[null,null,null,null,"-",{"$error":"#VALUE!"},{"$error":"#VALUE!"}]
[null,null,null,null,"-",{"$error":"#VALUE!"},{"$error":"#VALUE!"}]
[null,null,null,null,"-",{"$error":"#VALUE!"},{"$error":"#VALUE!"}]
[null,null,null,null,"-",{"$error":"#VALUE!"},{"$error":"#VALUE!"}]
[null,null,null,null,"-",{"$error":"#VALUE!"},{"$error":"#VALUE!"}]
[null,null,null,null,"-",{"$error":"#VALUE!"},{"$error":"#VALUE!"}]
[null,null,null,null,"-",{"$error":"#VALUE!"},{"$error":"#VALUE!"}]
[null,null,null,null,"-",{"$error":"#VALUE!"},{"$error":"#VALUE!"}]
[null,null,null,null,"-",{"$error":"#VALUE!"},{"$error":"#VALUE!"}]
[null,null,null,null,"-",{"$error":"#VALUE!"},{"$error":"#VALUE!"}]
[null,null,null,null,"-",{"$error":"#VALUE!"},{"$error":"#VALUE!"}]
[null,null,null,null,"-",{"$error":"#VALUE!"},{"$error":"#VALUE!"}]
[null,null,null,null,"-",{"$error":"#VALUE!"},{"$error":"#VALUE!"}]
[null,null,null,null,"-",{"$error":"#VALUE!"},{"$error":"#VALUE!"}]
[null,null,null,null,"-",{"$error":"#VALUE!"},{"$error":"#VALUE!"}]
[null,null,null,null,"-",{"$error":"#VALUE!"},{"$error":"#VALUE!"}]
[null,null,null,null,"-",{"$error":"#VALUE!"},{"$error":"#VALUE!"}]
[null,null,null,null,"-",{"$error":"#VALUE!"},{"$error":"#VALUE!"}]
[null,null,null,null,{"$f":"IFERROR(VLOOKUP(F769,A:A,1,0),\"-\")","v":"-"},{"$error":"#VALUE!"},{"$f":"VLOOKUP(F769,A:B,2,0)","v":{"$error":"#VALUE!"}}]
[null,null,null,null,"-",{"$error":"#VALUE!"},{"$error":"#VALUE!"}]
[null,null,null,null,"-",{"$f":"IF(LEFT(H771,1)=\"#\",\"\",MID(H771,FIND(\"rtp\",H771)+4,LEN(H771)-FIND(\"rtp\",H771)-3))","v":{"$error":"#VALUE!"}},{"$error":"#VALUE!"}]
[null,null,null,null,"-",{"$error":"#VALUE!"},{"$error":"#VALUE!"}]
[null,null,null,null,"-",{"$error":"#VALUE!"},{"$error":"#VALUE!"}]
[null,null,null,null,"-",{"$error":"#VALUE!"},{"$error":"#VALUE!"}]
[null,null,null,null,"-",{"$error":"#VALUE!"},{"$error":"#VALUE!"}]
[null,null,null,null,"-",{"$error":"#VALUE!"},{"$error":"#VALUE!"}]
[null,null,null,null,"-",{"$error":"#VALUE!"},{"$error":"#VALUE!"}]
[null,null,null,null,"-",{"$error":"#VALUE!"},{"$error":"#VALUE!"}]
[null,null,null,null,"-",{"$error":"#VALUE!"},{"$error":"#VALUE!"}]
[null,null,null,null,"-",{"$error":"#VALUE!"},{"$error":"#VALUE!"}]
[null,null,null,null,"-",{"$error":"#VALUE!"},{"$error":"#VALUE!"}]
[null,null,null,null,"-",{"$error":"#VALUE!"},{"$error":"#VALUE!"}]
[null,null,null,null,"-",{"$error":"#VALUE!"},{"$error":"#VALUE!"}]
[null,null,null,null,"-",{"$error":"#VALUE!"},{"$error":"#VALUE!"}]
[null,null,null,null,"-",{"$error":"#VALUE!"},{"$error":"#VALUE!"}]
[null,null,null,null,"-",{"$error":"#VALUE!"},{"$error":"#VALUE!"}]
[null,null,null,null,"-",{"$error":"#VALUE!"},{"$error":"#VALUE!"}]
[null,null,null,null,"-",{"$error":"#VALUE!"},{"$error":"#VALUE!"}]
[null,null,null,null,"-",{"$error":"#VALUE!"},{"$error":"#VALUE!"}]
[null,null,null,null,"-",{"$error":"#VALUE!"},{"$error":"#VALUE!"}]
[null,null,null,null,"-",{"$error":"#VALUE!"},{"$error":"#VALUE!"}]
[null,null,null,null,"-",{"$error":"#VALUE!"},{"$error":"#VALUE!"}]
[null,null,null,null,"-",{"$error":"#VALUE!"},{"$error":"#VALUE!"}]
[null,null,null,null,"-",{"$error":"#VALUE!"},{"$error":"#VALUE!"}]
[null,null,null,null,"-",{"$error":"#VALUE!"},{"$error":"#VALUE!"}]
[null,null,null,null,"-",{"$error":"#VALUE!"},{"$error":"#VALUE!"}]
[null,null,null,null,"-",{"$error":"#VALUE!"},{"$error":"#VALUE!"}]
[null,null,null,null,"-",{"$error":"#VALUE!"},{"$error":"#VALUE!"}]
[null,null,null,null,"-",{"$error":"#VALUE!"},{"$error":"#VALUE!"}]
[null,null,null,null,"-",{"$error":"#VALUE!"},{"$error":"#VALUE!"}]
[null,null,null,null,"-",{"$error":"#VALUE!"},{"$error":"#VALUE!"}]
[null,null,null,null,"-",{"$error":"#VALUE!"},{"$error":"#VALUE!"}]
[null,null,null,null,"-",{"$error":"#VALUE!"},{"$error":"#VALUE!"}]
[null,null,null,null,"-",{"$error":"#VALUE!"},{"$error":"#VALUE!"}]
[null,null,null,null,"-",{"$error":"#VALUE!"},{"$error":"#VALUE!"}]
[null,null,null,null,"-",{"$error":"#VALUE!"},{"$error":"#VALUE!"}]
[null,null,null,null,"-",{"$error":"#VALUE!"},{"$error":"#VALUE!"}]
[null,null,null,null,"-",{"$error":"#VALUE!"},{"$error":"#VALUE!"}]
[null,null,null,null,"-",{"$error":"#VALUE!"},{"$error":"#VALUE!"}]
[null,null,null,null,"-",{"$error":"#VALUE!"},{"$error":"#VALUE!"}]
[null,null,null,null,"-",{"$error":"#VALUE!"},{"$error":"#VALUE!"}]
[null,null,null,null,"-",{"$error":"#VALUE!"},{"$error":"#VALUE!"}]
[null,null,null,null,"-",{"$error":"#VALUE!"},{"$error":"#VALUE!"}]
[null,null,null,null,"-",{"$error":"#VALUE!"},{"$error":"#VALUE!"}]
[null,null,null,null,"-",{"$error":"#VALUE!"},{"$error":"#VALUE!"}]
[null,null,null,null,"-",{"$error":"#VALUE!"},{"$error":"#VALUE!"}]
[null,null,null,null,"-",{"$error":"#VALUE!"},{"$error":"#VALUE!"}]
[null,null,null,null,"-",{"$error":"#VALUE!"},{"$error":"#VALUE!"}]
[null,null,null,null,"-",{"$error":"#VALUE!"},{"$error":"#VALUE!"}]
[null,null,null,null,"-",{"$error":"#VALUE!"},{"$error":"#VALUE!"}]
[null,null,null,null,"-",{"$error":"#VALUE!"},{"$error":"#VALUE!"}]
[null,null,null,null,"-",{"$error":"#VALUE!"},{"$error":"#VALUE!"}]
[null,null,null,null,"-",{"$error":"#VALUE!"},{"$error":"#VALUE!"}]
[null,null,null,null,"-",{"$error":"#VALUE!"},{"$error":"#VALUE!"}]
[null,null,null,null,"-",{"$error":"#VALUE!"},{"$error":"#VALUE!"}]
[null,null,null,null,"-",{"$error":"#VALUE!"},{"$error":"#VALUE!"}]
[null,null,null,null,"-",{"$error":"#VALUE!"},{"$error":"#VALUE!"}]
[null,null,null,null,"-",{"$error":"#VALUE!"},{"$error":"#VALUE!"}]
[null,null,null,null,"-",{"$error":"#VALUE!"},{"$error":"#VALUE!"}]
[null,null,null,null,"-",{"$error":"#VALUE!"},{"$error":"#VALUE!"}]
[null,null,null,null,"-",{"$error":"#VALUE!"},{"$error":"#VALUE!"}]
[null,null,null,null,"-",{"$error":"#VALUE!"},{"$error":"#VALUE!"}]
[null,null,null,null,{"$f":"IFERROR(VLOOKUP(F833,A:A,1,0),\"-\")","v":"-"},{"$error":"#VALUE!"},{"$f":"VLOOKUP(F833,A:B,2,0)","v":{"$error":"#VALUE!"}}]
[null,null,null,null,"-",{"$error":"#VALUE!"},{"$error":"#VALUE!"}]
[null,null,null,null,"-",{"$f":"IF(LEFT(H835,1)=\"#\",\"\",MID(H835,FIND(\"rtp\",H835)+4,LEN(H835)-FIND(\"rtp\",H835)-3))","v":{"$error":"#VALUE!"}},{"$error":"#VALUE!"}]
[null,null,null,null,"-",{"$error":"#VALUE!"},{"$error":"#VALUE!"}]
[null,null,null,null,"-",{"$error":"#VALUE!"},{"$error":"#VALUE!"}]
[null,null,null,null,"-",{"$error":"#VALUE!"},{"$error":"#VALUE!"}]
[null,null,null,null,"-",{"$error":"#VALUE!"},{"$error":"#VALUE!"}]
[null,null,null,null,"-",{"$error":"#VALUE!"},{"$error":"#VALUE!"}]
[null,null,null,null,"-",{"$error":"#VALUE!"},{"$error":"#VALUE!"}]
[null,null,null,null,"-",{"$error":"#VALUE!"},{"$error":"#VALUE!"}]
[null,null,null,null,"-",{"$error":"#VALUE!"},{"$error":"#VALUE!"}]
[null,null,null,null,"-",{"$error":"#VALUE!"},{"$error":"#VALUE!"}]
[null,null,null,null,"-",{"$error":"#VALUE!"},{"$error":"#VALUE!"}]
[null,null,null,null,"-",{"$error":"#VALUE!"},{"$error":"#VALUE!"}]
[null,null,null,null,"-",{"$error":"#VALUE!"},{"$error":"#VALUE!"}]
[null,null,null,null,"-",{"$error":"#VALUE!"},{"$error":"#VALUE!"}]
[null,null,null,null,"-",{"$error":"#VALUE!"},{"$error":"#VALUE!"}]
[null,null,null,null,"-",{"$error":"#VALUE!"},{"$error":"#VALUE!"}]
[null,null,null,null,"-",{"$error":"#VALUE!"},{"$error":"#VALUE!"}]
[null,null,null,null,"-",{"$error":"#VALUE!"},{"$error":"#VALUE!"}]
[null,null,null,null,"-",{"$error":"#VALUE!"},{"$error":"#VALUE!"}]
[null,null,null,null,"-",{"$error":"#VALUE!"},{"$error":"#VALUE!"}]
[null,null,null,null,"-",{"$error":"#VALUE!"},{"$error":"#VALUE!"}]
[null,null,null,null,"-",{"$error":"#VALUE!"},{"$error":"#VALUE!"}]
[null,null,null,null,"-",{"$error":"#VALUE!"},{"$error":"#VALUE!"}]
[null,null,null,null,"-",{"$error":"#VALUE!"},{"$error":"#VALUE!"}]
[null,null,null,null,"-",{"$error":"#VALUE!"},{"$error":"#VALUE!"}]
[null,null,null,null,"-",{"$error":"#VALUE!"},{"$error":"#VALUE!"}]
[null,null,null,null,"-",{"$error":"#VALUE!"},{"$error":"#VALUE!"}]
[null,null,null,null,"-",{"$error":"#VALUE!"},{"$error":"#VALUE!"}]
[null,null,null,null,"-",{"$error":"#VALUE!"},{"$error":"#VALUE!"}]
[null,null,null,null,"-",{"$error":"#VALUE!"},{"$error":"#VALUE!"}]
[null,null,null,null,"-",{"$error":"#VALUE!"},{"$error":"#VALUE!"}]
[null,null,null,null,"-",{"$error":"#VALUE!"},{"$error":"#VALUE!"}]
[null,null,null,null,"-",{"$error":"#VALUE!"},{"$error":"#VALUE!"}]
[null,null,null,null,"-",{"$error":"#VALUE!"},{"$error":"#VALUE!"}]
[null,null,null,null,"-",{"$error":"#VALUE!"},{"$error":"#VALUE!"}]
[null,null,null,null,"-",{"$error":"#VALUE!"},{"$error":"#VALUE!"}]
[null,null,null,null,"-",{"$error":"#VALUE!"},{"$error":"#VALUE!"}]
[null,null,null,null,"-",{"$error":"#VALUE!"},{"$error":"#VALUE!"}]
[null,null,null,null,"-",{"$error":"#VALUE!"},{"$error":"#VALUE!"}]
[null,null,null,null,"-",{"$error":"#VALUE!"},{"$error":"#VALUE!"}]
[null,null,null,null,"-",{"$error":"#VALUE!"},{"$error":"#VALUE!"}]
[null,null,null,null,"-",{"$error":"#VALUE!"},{"$error":"#VALUE!"}]
[null,null,null,null,"-",{"$error":"#VALUE!"},{"$error":"#VALUE!"}]
[null,null,null,null,"-",{"$error":"#VALUE!"},{"$error":"#VALUE!"}]
[null,null,null,null,"-",{"$error":"#VALUE!"},{"$error":"#VALUE!"}]
[null,null,null,null,"-",{"$error":"#VALUE!"},{"$error":"#VALUE!"}]
[null,null,null,null,"-",{"$error":"#VALUE!"},{"$error":"#VALUE!"}]
[null,null,null,null,"-",{"$error":"#VALUE!"},{"$error":"#VALUE!"}]
[null,null,null,null,"-",{"$error":"#VALUE!"},{"$error":"#VALUE!"}]
[null,null,null,null,"-",{"$error":"#VALUE!"},{"$error":"#VALUE!"}]
[null,null,null,null,"-",{"$error":"#VALUE!"},{"$error":"#VALUE!"}]
[null,null,null,null,"-",{"$error":"#VALUE!"},{"$error":"#VALUE!"}]
[null,null,null,null,"-",{"$error":"#VALUE!"},{"$error":"#VALUE!"}]
[null,null,null,null,"-",{"$error":"#VALUE!"},{"$error":"#VALUE!"}]
[null,null,null,null,"-",{"$error":"#VALUE!"},{"$error":"#VALUE!"}]
[null,null,null,null,"-",{"$error":"#VALUE!"},{"$error":"#VALUE!"}]
[null,null,null,null,"-",{"$error":"#VALUE!"},{"$error":"#VALUE!"}]
[null,null,null,null,"-",{"$error":"#VALUE!"},{"$error":"#VALUE!"}]
[null,null,null,null,"-",{"$error":"#VALUE!"},{"$error":"#VALUE!"}]
[null,null,null,null,"-",{"$error":"#VALUE!"},{"$error":"#VALUE!"}]
[null,null,null,null,"-",{"$error":"#VALUE!"},{"$error":"#VALUE!"}]
[null,null,null,null,"-",{"$error":"#VALUE!"},{"$error":"#VALUE!"}]
[null,null,null,null,{"$f":"IFERROR(VLOOKUP(F897,A:A,1,0),\"-\")","v":"-"},{"$error":"#VALUE!"},{"$f":"VLOOKUP(F897,A:B,2,0)","v":{"$error":"#VALUE!"}}]
[null,null,null,null,"-",{"$error":"#VALUE!"},{"$error":"#VALUE!"}]
[null,null,null,null,"-",{"$f":"IF(LEFT(H899,1)=\"#\",\"\",MID(H899,FIND(\"rtp\",H899)+4,LEN(H899)-FIND(\"rtp\",H899)-3))","v":{"$error":"#VALUE!"}},{"$error":"#VALUE!"}]
[null,null,null,null,"-",{"$error":"#VALUE!"},{"$error":"#VALUE!"}]
[null,null,null,null,"-",{"$error":"#VALUE!"},{"$error":"#VALUE!"}]
[null,null,null,null,"-",{"$error":"#VALUE!"},{"$error":"#VALUE!"}]
[null,null,null,null,"-",{"$error":"#VALUE!"},{"$error":"#VALUE!"}]
[null,null,null,null,"-",{"$error":"#VALUE!"},{"$error":"#VALUE!"}]
[null,null,null,null,"-",{"$error":"#VALUE!"},{"$error":"#VALUE!"}]
[null,null,null,null,"-",{"$error":"#VALUE!"},{"$error":"#VALUE!"}]
[null,null,null,null,"-",{"$error":"#VALUE!"},{"$error":"#VALUE!"}]
[null,null,null,null,"-",{"$error":"#VALUE!"},{"$error":"#VALUE!"}]
[null,null,null,null,"-",{"$error":"#VALUE!"},{"$error":"#VALUE!"}]
[null,null,null,null,"-",{"$error":"#VALUE!"},{"$error":"#VALUE!"}]
[null,null,null,null,"-",{"$error":"#VALUE!"},{"$error":"#VALUE!"}]
[null,null,null,null,"-",{"$error":"#VALUE!"},{"$error":"#VALUE!"}]
[null,null,null,null,"-",{"$error":"#VALUE!"},{"$error":"#VALUE!"}]
[null,null,null,null,"-",{"$error":"#VALUE!"},{"$error":"#VALUE!"}]
[null,null,null,null,"-",{"$error":"#VALUE!"},{"$error":"#VALUE!"}]
[null,null,null,null,"-",{"$error":"#VALUE!"},{"$error":"#VALUE!"}]
[null,null,null,null,"-",{"$error":"#VALUE!"},{"$error":"#VALUE!"}]
[null,null,null,null,"-",{"$error":"#VALUE!"},{"$error":"#VALUE!"}]
[null,null,null,null,"-",{"$error":"#VALUE!"},{"$error":"#VALUE!"}]
[null,null,null,null,"-",{"$error":"#VALUE!"},{"$error":"#VALUE!"}]
[null,null,null,null,"-",{"$error":"#VALUE!"},{"$error":"#VALUE!"}]
[null,null,null,null,"-",{"$error":"#VALUE!"},{"$error":"#VALUE!"}]
[null,null,null,null,"-",{"$error":"#VALUE!"},{"$error":"#VALUE!"}]
[null,null,null,null,"-",{"$error":"#VALUE!"},{"$error":"#VALUE!"}]
[null,null,null,null,"-",{"$error":"#VALUE!"},{"$error":"#VALUE!"}]
[null,null,null,null,"-",{"$error":"#VALUE!"},{"$error":"#VALUE!"}]
[null,null,null,null,"-",{"$error":"#VALUE!"},{"$error":"#VALUE!"}]
[null,null,null,null,"-",{"$error":"#VALUE!"},{"$error":"#VALUE!"}]
[null,null,null,null,"-",{"$error":"#VALUE!"},{"$error":"#VALUE!"}]
[null,null,null,null,"-",{"$error":"#VALUE!"},{"$error":"#VALUE!"}]
[null,null,null,null,"-",{"$error":"#VALUE!"},{"$error":"#VALUE!"}]
[null,null,null,null,"-",{"$error":"#VALUE!"},{"$error":"#VALUE!"}]
[null,null,null,null,"-",{"$error":"#VALUE!"},{"$error":"#VALUE!"}]
[null,null,null,null,"-",{"$error":"#VALUE!"},{"$error":"#VALUE!"}]

{"sheet":"txt","index":1,"n_rows":384,"n_cols":8,"rows_kept":384,"cut":false,"hidden":false,"merged":[]}
["扫描结果",null,null,null,"匹配","提取信息","信息","txt"]
["239.77.0.1:5146","HD (V: h264; A: mp2@2ch)",null,null,{"$f":"VLOOKUP(F2,A:A,1,0)","v":"239.77.1.19:5146"},{"$f":"MID(H2,FIND(\"/rtp/\",H2)+5,LEN(H2)-FIND(\"/rtp/\",H2)-4)","v":"239.77.1.19:5146"},{"$f":"VLOOKUP(F2,A:B,2,0)","v":"HD (V: h264; A: mp2@2ch)"},"广东卫视高清,http://faim.top:12306/rtp/239.77.1.19:5146"]
["239.77.0.2:5146","4K (V: hevc; A: aac@2ch)",null,null,{"$f":"VLOOKUP(F3,A:A,1,0)","v":"239.77.1.152:5146"},{"$f":"MID(H3,FIND(\"/rtp/\",H3)+5,LEN(H3)-FIND(\"/rtp/\",H3)-4)","v":"239.77.1.152:5146"},{"$f":"VLOOKUP(F3,A:B,2,0)","v":"HD (V: mpeg2video; A: ac3@6ch)"},"广东卫视高清,http://faim.top:12306/rtp/239.77.1.152:5146"]
["239.77.0.3:5146","4K (V: hevc; A: ac3@6ch)",null,null,"239.77.0.84:5146","239.77.0.84:5146","HD (V: h264; A: mp2@2ch)","广东卫视高清,http://faim.top:12306/rtp/239.77.0.84:5146"]
["239.77.0.10:5146","SD (V: h264; A: mp2@2ch)",null,null,"239.77.0.166:5146","239.77.0.166:5146","HD (V: h264; A: mp2@2ch)","广东卫视超清,http://faim.top:12306/rtp/239.77.0.166:5146"]
["239.77.0.14:5146","SD (V: h264; A: mp2@2ch)",null,null,"239.77.0.3:5146","239.77.0.3:5146","4K (V: hevc; A: ac3@6ch)","广东珠江,http://faim.top:12306/rtp/239.77.0.3:5146"]
["239.77.0.15:5146","HD (V: h264; A: mp2@2ch)",null,null,"239.77.1.94:5146","239.77.1.94:5146","SD (V: h264; A: mp2@2ch)","广东珠江,http://faim.top:12306/rtp/239.77.1.94:5146"]
["239.77.0.17:5146","HD (V: h264; A: mp2@2ch)",null,null,"239.77.0.1:5146","239.77.0.1:5146","HD (V: h264; A: mp2@2ch)","广东珠江高清,http://faim.top:12306/rtp/239.77.0.1:5146"]
["239.77.0.19:5146","HD (V: h264; A: mp2@2ch)",null,null,"239.77.0.114:5146","239.77.0.114:5146","HD (V: h264; A: mp2@2ch)","广东珠江超清,http://faim.top:12306/rtp/239.77.0.114:5146"]
["239.77.0.20:5146","SD (V: h264; A: mp2@2ch)",null,null,"239.77.0.173:5146","239.77.0.173:5146","HD (V: h264; A: mp2@2ch)","广东新闻高清,http://faim.top:12306/rtp/239.77.0.173:5146"]
["239.77.0.21:5146","HD (V: h264; A: mp2@2ch)",null,null,"239.77.0.225:5146","239.77.0.225:5146","HD (V: h264; A: mp2@2ch)","广东民生高清,http://faim.top:12306/rtp/239.77.0.225:5146"]
["239.77.0.22:5146","HD (V: h264; A: mp2@2ch)",null,null,"239.77.1.97:5146","239.77.1.97:5146","SD (V: h264; A: mp2@2ch)","广东体育（深圳）,http://faim.top:12306/rtp/239.77.1.97:5146"]
["239.77.0.25:5146","HD (V: h264; A: mp2@2ch)",null,null,"239.77.0.112:5146","239.77.0.112:5146","HD (V: h264; A: mp2@2ch)","广东体育高清-测试,http://faim.top:12306/rtp/239.77.0.112:5146"]
["239.77.0.28:5146","SD (V: h264; A: mp2@2ch)",null,null,"239.77.0.168:5146","239.77.0.168:5146","HD (V: h264; A: mp2@2ch)","广东体育超清,http://faim.top:12306/rtp/239.77.0.168:5146"]
["239.77.0.30:5146","SD (V: h264; A: mp2@2ch)",null,null,"239.77.0.85:5146","239.77.0.85:5146","HD (V: h264; A: mp2@2ch)","经济科教高清,http://faim.top:12306/rtp/239.77.0.85:5146"]
["239.77.0.31:5146","SD (V: h264; A: mp2@2ch)",null,null,"239.77.0.167:5146","239.77.0.167:5146","HD (V: h264; A: mp2@2ch)","经济科教超清,http://faim.top:12306/rtp/239.77.0.167:5146"]
["239.77.0.32:5146","SD (V: h264; A: mp2@2ch)",null,null,"239.77.1.12:5146","239.77.1.12:5146","SD (V: h264; A: mp2@2ch)","大湾区卫视,http://faim.top:12306/rtp/239.77.1.12:5146"]
["239.77.0.33:5146","SD (V: h264; A: mp2@2ch)",null,null,"239.77.0.215:5146","239.77.0.215:5146","HD (V: h264; A: mp2@2ch)","大湾区卫视高清,http://faim.top:12306/rtp/239.77.0.215:5146"]
["239.77.0.34:5146","SD (V: h264; A: mp2@2ch)",null,null,"239.77.0.217:5146","239.77.0.217:5146","HD (V: h264; A: mp2@2ch)","广东影视高清,http://faim.top:12306/rtp/239.77.0.217:5146"]
["239.77.0.35:5146","SD (V: h264; A: mp2@2ch)",null,null,"239.77.0.250:5146","239.77.0.250:5146","HD (V: h264; A: mp2@2ch)","广东少儿高清,http://faim.top:12306/rtp/239.77.0.250:5146"]
["239.77.0.36:5146","SD (V: h264; A: mp2@2ch)",null,null,"239.77.1.15:5146","239.77.1.15:5146","SD (V: h264; A: mp2@2ch)","嘉佳卡通,http://faim.top:12306/rtp/239.77.1.15:5146"]
["239.77.0.37:5146","SD (V: h264; A: mp2@2ch)",null,null,"239.77.0.179:5146","239.77.0.179:5146","HD (V: h264; A: mp2@2ch)","嘉佳卡通高清,http://faim.top:12306/rtp/239.77.0.179:5146"]
["239.77.0.38:5146","SD (V: h264; A: mp2@2ch)",null,null,"239.77.0.19:5146","239.77.0.19:5146","HD (V: h264; A: mp2@2ch)","南方购物-精选,http://faim.top:12306/rtp/239.77.0.19:5146"]
["239.77.0.39:5146","SD (V: h264; A: mp2@2ch)",null,null,"239.77.0.22:5146","239.77.0.22:5146","HD (V: h264; A: mp2@2ch)","南方购物,http://faim.top:12306/rtp/239.77.0.22:5146"]
["239.77.0.40:5146","SD (V: h264; A: mp2@2ch)",null,null,"239.77.0.241:5146","239.77.0.241:5146","SD (V: h264; A: mp2@2ch)","南方购物高清,http://faim.top:12306/rtp/239.77.0.241:5146"]
["239.77.0.41:5146","SD (V: h264; A: mp2@2ch)",null,null,"239.77.0.122:5146","239.77.0.122:5146","HD (V: h264; A: mp2@2ch)","岭南戏曲高清,http://faim.top:12306/rtp/239.77.0.122:5146"]
["239.77.0.42:5146","SD (V: h264; A: mp2@2ch)",null,null,"239.77.0.213:5146","239.77.0.213:5146","HD (V: h264; A: mp2@2ch)","现代教育高清,http://faim.top:12306/rtp/239.77.0.213:5146"]
["239.77.0.43:5146","SD (V: h264; A: mp2@2ch)",null,null,"239.77.0.20:5146","239.77.0.20:5146","SD (V: h264; A: mp2@2ch)","广东移动,http://faim.top:12306/rtp/239.77.0.20:5146"]
["239.77.0.44:5146","SD (V: h264; A: mp2@2ch)",null,null,"239.77.1.237:5146","239.77.1.237:5146","4K (V: hevc; A: aac@2ch)","广东综艺 4K,http://faim.top:12306/rtp/239.77.1.237:5146"]
["239.77.0.45:5146","SD (V: h264; A: mp2@2ch)",null,null,"239.77.0.244:5146","239.77.0.244:5146","4K (V: hevc; A: ac3@2ch)","广东综艺(4k),http://faim.top:12306/rtp/239.77.0.244:5146"]
["239.77.0.68:5146","SD (V: h264; A: mp2@2ch)",null,null,"239.77.0.245:5146","239.77.0.245:5146","4K (V: hevc; A: aac@2ch)","广东综艺(4k),http://faim.top:12306/rtp/239.77.0.245:5146"]
["239.77.0.69:5146","SD (V: h264; A: mp2@2ch)",null,null,"239.77.0.252:5146","239.77.0.252:5146","4K (V: avs2; A: ac3@6ch)","广东综艺 宽色域AVS2(4k) (AVS2),http://faim.top:12306/rtp/239.77.0.252:5146"]
["239.77.0.70:5146","SD (V: h264; A: mp2@2ch)",null,null,"239.253.43.71:5146","239.253.43.71:5146","HD (V: h264; A: mp2@2ch)","广州综合高清,http://faim.top:12306/rtp/239.253.43.71:5146"]
["239.77.0.73:5146","SD (V: h264; A: mp2@2ch)",null,null,"239.253.43.72:5146","239.253.43.72:5146","HD (V: h264; A: mp2@2ch)","广州新闻高清,http://faim.top:12306/rtp/239.253.43.72:5146"]
["239.77.0.74:5146","SD (V: h264; A: mp2@2ch)",null,null,"239.253.43.73:5146","239.253.43.73:5146","HD (V: h264; A: mp2@2ch)","广州影视高清,http://faim.top:12306/rtp/239.253.43.73:5146"]
["239.77.0.75:5146","SD (V: h264; A: mp2@2ch)",null,null,"239.253.43.74:5146","239.253.43.74:5146","HD (V: h264; A: mp2@2ch)","广州法治高清,http://faim.top:12306/rtp/239.253.43.74:5146"]
["239.77.0.77:5146","SD (V: h264; A: mp2@2ch)",null,null,"239.253.43.99:5146","239.253.43.99:5146","4K (V: hevc; A: aac@2ch)","南国都市 4K,http://faim.top:12306/rtp/239.253.43.99:5146"]
["239.77.0.78:5146","HD (V: h264; A: mp2@2ch)",null,null,"239.77.1.3:5146","239.77.1.3:5146","HD (V: h264; A: mp2@2ch)","深圳卫视高清,http://faim.top:12306/rtp/239.77.1.3:5146"]
["239.77.0.79:5146","SD (V: h264; A: mp2@2ch)",null,null,"239.77.1.148:5146","239.77.1.148:5146","HD (V: h264; A: mp2@2ch)","深圳卫视高清,http://faim.top:12306/rtp/239.77.1.148:5146"]
["239.77.0.81:5146","SD (V: h264; A: mp2@1ch)",null,null,"239.77.0.92:5146","239.77.0.92:5146","HD (V: h264; A: mp2@2ch)","深圳卫视高清,http://faim.top:12306/rtp/239.77.0.92:5146"]
["239.77.0.83:5146","SD (V: h264; A: mp2@1ch)",null,null,"239.77.0.130:5146","239.77.0.130:5146","HD (V: mpeg2video; A: ac3@2ch)","深圳卫视超清,http://faim.top:12306/rtp/239.77.0.130:5146"]
["239.77.0.84:5146","HD (V: h264; A: mp2@2ch)",null,null,"239.77.1.176:5146","239.77.1.176:5146","HD (V: h264; A: mp2@2ch)","深圳都市频道高清,http://faim.top:12306/rtp/239.77.1.176:5146"]
["239.77.0.85:5146","HD (V: h264; A: mp2@2ch)",null,null,"239.77.1.124:5146","239.77.1.124:5146","HD (V: h264; A: mp2@2ch)","深圳都市频道高清,http://faim.top:12306/rtp/239.77.1.124:5146"]
["239.77.0.86:5146","HD (V: h264; A: mp2@2ch)",null,null,"239.77.1.177:5146","239.77.1.177:5146","HD (V: h264; A: mp2@2ch)","深圳电视剧频道高清,http://faim.top:12306/rtp/239.77.1.177:5146"]
["239.77.0.87:5146","HD (V: h264; A: mp2@2ch)",null,null,"239.77.1.125:5146","239.77.1.125:5146","HD (V: h264; A: mp2@2ch)","深圳电视剧频道高清,http://faim.top:12306/rtp/239.77.1.125:5146"]
["239.77.0.88:5146","HD (V: h264; A: mp2@2ch)",null,null,"239.77.1.242:5146","239.77.1.242:5146","HD (V: h264; A: mp2@2ch)","深圳财经生活高清,http://faim.top:12306/rtp/239.77.1.242:5146"]
["239.77.0.89:5146","HD (V: h264; A: mp2@2ch)",null,null,"239.77.1.128:5146","239.77.1.128:5146","HD (V: h264; A: mp2@2ch)","深圳体育健康高清,http://faim.top:12306/rtp/239.77.1.128:5146"]
["239.77.0.90:5146","HD (V: h264; A: mp2@2ch)",null,null,"239.77.1.140:5146","239.77.1.140:5146","HD (V: h264; A: mp2@2ch)","深圳体育健康高清,http://faim.top:12306/rtp/239.77.1.140:5146"]
["239.77.0.91:5146","HD (V: h264; A: mp2@2ch)",null,null,"239.77.1.244:5146","239.77.1.244:5146","HD (V: h264; A: mp2@2ch)","深圳少儿频道高清,http://faim.top:12306/rtp/239.77.1.244:5146"]
["239.77.0.92:5146","HD (V: h264; A: mp2@2ch)",null,null,"239.77.1.67:5146","239.77.1.67:5146","HD (V: h264; A: mp2@2ch)","深圳宝安频道高清,http://faim.top:12306/rtp/239.77.1.67:5146"]
["239.77.0.93:5146","HD (V: h264; A: mp2@2ch)",null,null,"239.77.1.225:5146","239.77.1.225:5146","SD (V: h264; A: mp2@2ch)","深圳宝安第一课,http://faim.top:12306/rtp/239.77.1.225:5146"]
["239.77.0.94:5146","HD (V: h264; A: mp2@2ch)",null,null,"239.77.1.223:5146","239.77.1.223:5146","HD (V: h264; A: mp2@2ch)","深圳龙岗频道高清,http://faim.top:12306/rtp/239.77.1.223:5146"]
["239.77.0.95:5146","HD (V: h264; A: mp2@2ch)",null,null,"239.77.1.175:5146","239.77.1.175:5146","SD (V: h264; A: mp2@2ch)","深圳移动电视,http://faim.top:12306/rtp/239.77.1.175:5146"]
["239.77.0.96:5146","SD (V: h264; A: mp2@2ch)",null,null,"239.77.1.87:5146","239.77.1.87:5146","HD (V: h264; A: mp2@2ch)","深圳宜和购物高清,http://faim.top:12306/rtp/239.77.1.87:5146"]
["239.77.0.97:5146","HD (V: h264; A: mp2@2ch)",null,null,"239.77.0.117:5146","239.77.0.117:5146","HD (V: h264; A: mp2@2ch)","韶关新闻综合高清,http://faim.top:12306/rtp/239.77.0.117:5146"]
["239.77.0.98:5146","HD (V: h264; A: mp2@2ch)",null,null,"239.77.0.141:5146","239.77.0.141:5146","HD (V: h264; A: mp2@2ch)","湛江新闻综合高清,http://faim.top:12306/rtp/239.77.0.141:5146"]
["239.77.0.99:5146","HD (V: h264; A: mp2@2ch)",null,null,"239.77.0.140:5146","239.77.0.140:5146","HD (V: h264; A: mp2@2ch)","湛江公共高清,http://faim.top:12306/rtp/239.77.0.140:5146"]
["239.77.0.100:5146","HD (V: h264; A: mp2@2ch)",null,null,"239.77.0.229:5146","239.77.0.229:5146","HD (V: h264; A: mp2@2ch)","揭阳综合高清,http://faim.top:12306/rtp/239.77.0.229:5146"]
["239.77.0.101:5146","HD (V: h264; A: mp2@2ch)",null,null,"239.77.0.251:5146","239.77.0.251:5146","HD (V: h264; A: mp2@2ch)","揭阳生活高清,http://faim.top:12306/rtp/239.77.0.251:5146"]
["239.77.0.102:5146","HD (V: h264; A: mp2@2ch)",null,null,"239.77.0.25:5146","239.77.0.25:5146","HD (V: h264; A: mp2@2ch)","汕尾新闻综合高清,http://faim.top:12306/rtp/239.77.0.25:5146"]
["239.77.0.103:5146","HD (V: h264; A: mp2@2ch)",null,null,"239.77.0.187:5146","239.77.0.187:5146","HD (V: h264; A: mp2@2ch)","汕尾文化生活高清,http://faim.top:12306/rtp/239.77.0.187:5146"]
["239.77.0.104:5146","HD (V: h264; A: mp2@2ch)",null,null,"239.77.0.201:5146","239.77.0.201:5146","HD (V: h264; A: mp2@2ch)","江门综合高清,http://faim.top:12306/rtp/239.77.0.201:5146"]
["239.77.0.105:5146","HD (V: h264; A: mp2@2ch)",null,null,"239.77.0.202:5146","239.77.0.202:5146","HD (V: h264; A: mp2@2ch)","江门侨乡生活高清,http://faim.top:12306/rtp/239.77.0.202:5146"]
["239.77.0.106:5146","HD (V: h264; A: mp2@2ch)",null,null,"239.77.1.232:5146","239.77.1.232:5146","HD (V: h264; A: mp2@2ch)","HZTV-1高清,http://faim.top:12306/rtp/239.77.1.232:5146"]
["239.77.0.107:5146","HD (V: h264; A: mp2@2ch)",null,null,"239.77.1.233:5146","239.77.1.233:5146","HD (V: h264; A: mp2@2ch)","HZTV-2高清,http://faim.top:12306/rtp/239.77.1.233:5146"]
["239.77.0.108:5146","HD (V: h264; A: mp2@2ch)",null,null,"239.77.0.155:5146","239.77.0.155:5146","HD (V: h264; A: mp2@2ch)","珠海-1高清,http://faim.top:12306/rtp/239.77.0.155:5146"]
["239.77.0.109:5146","HD (V: h264; A: mp2@2ch)",null,null,{"$f":"VLOOKUP(F67,A:A,1,0)","v":"239.253.43.1:5146"},{"$f":"MID(H67,FIND(\"/rtp/\",H67)+5,LEN(H67)-FIND(\"/rtp/\",H67)-4)","v":"239.253.43.1:5146"},{"$f":"VLOOKUP(F67,A:B,2,0)","v":"HD (V: h264; A: mp2@2ch)"},"肇庆综合高清,http://faim.top:12306/rtp/239.253.43.1:5146"]
["239.77.0.110:5146","HD (V: h264; A: mp2@2ch)",null,null,"239.253.43.2:5146","239.253.43.2:5146","HD (V: h264; A: mp2@2ch)","肇庆生活服务高清,http://faim.top:12306/rtp/239.253.43.2:5146"]
["239.77.0.111:5146","HD (V: h264; A: mp2@2ch)",null,null,"239.253.43.213:5146","239.253.43.213:5146","HD (V: h264; A: mp2@2ch)","河源综合高清,http://faim.top:12306/rtp/239.253.43.213:5146"]
["239.77.0.112:5146","HD (V: h264; A: mp2@2ch)",null,null,"239.253.43.214:5146","239.253.43.214:5146","HD (V: h264; A: mp2@2ch)","河源公共高清,http://faim.top:12306/rtp/239.253.43.214:5146"]
["239.77.0.113:5146","SD (V: h264; A: mp2@2ch)",null,null,"239.253.43.33:5146","239.253.43.33:5146","HD (V: h264; A: mp2@2ch)","清远新闻综合高清,http://faim.top:12306/rtp/239.253.43.33:5146"]
["239.77.0.114:5146","HD (V: h264; A: mp2@2ch)",null,null,"239.253.43.34:5146","239.253.43.34:5146","HD (V: h264; A: mp2@2ch)","清远文旅生活高清,http://faim.top:12306/rtp/239.253.43.34:5146"]
["239.77.0.115:5146","SD (V: h264; A: mp2@2ch)",null,null,"239.77.0.253:5146","239.77.0.253:5146","HD (V: h264; A: mp2@2ch)","云浮综合高清,http://faim.top:12306/rtp/239.77.0.253:5146"]
["239.77.0.117:5146","HD (V: h264; A: mp2@2ch)",null,null,"239.77.0.254:5146","239.77.0.254:5146","HD (V: h264; A: mp2@2ch)","云浮文旅高清,http://faim.top:12306/rtp/239.77.0.254:5146"]
["239.77.0.119:5146","HD (V: h264; A: mp2@2ch)",null,null,"239.77.0.206:5146","239.77.0.206:5146","HD (V: h264; A: mp2@2ch)","茂名综合高清,http://faim.top:12306/rtp/239.77.0.206:5146"]
["239.77.0.122:5146","HD (V: h264; A: mp2@2ch)",null,null,"239.77.0.207:5146","239.77.0.207:5146","HD (V: h264; A: mp2@2ch)","茂名公共高清,http://faim.top:12306/rtp/239.77.0.207:5146"]
["239.77.0.123:5146","HD (V: h264; A: mp2@2ch)",null,null,"239.77.1.130:5146","239.77.1.130:5146","HD (V: h264; A: mp2@2ch)","汕头综合高清,http://faim.top:12306/rtp/239.77.1.130:5146"]
["239.77.0.124:5146","HD (V: mpeg2video; A: ac3@2ch, mp2@2ch)",null,null,"239.253.43.45:5146","239.253.43.45:5146","HD (V: h264; A: mp2@2ch)","汕头综合高清,http://faim.top:12306/rtp/239.253.43.45:5146"]
["239.77.0.125:5146","HD (V: cavs; A: ac3@6ch)",null,null,"239.77.1.131:5146","239.77.1.131:5146","HD (V: h264; A: mp2@2ch)","汕头经济生活高清,http://faim.top:12306/rtp/239.77.1.131:5146"]
["239.77.0.126:5146","HD (V: cavs; A: ac3@6ch)",null,null,"239.253.43.46:5146","239.253.43.46:5146","HD (V: h264; A: mp2@2ch)","汕头经济生活高清,http://faim.top:12306/rtp/239.253.43.46:5146"]
["239.77.0.127:5146","HD (V: cavs; A: eac3@6ch, ac3@6ch)",null,null,"239.77.1.132:5146","239.77.1.132:5146"," (; )","汕头文旅体育高清,http://faim.top:12306/rtp/239.77.1.132:5146"]
["239.77.0.128:5146","HD (V: mpeg2video; A: ac3@2ch)",null,null,"239.253.43.53:5146","239.253.43.53:5146","HD (V: h264; A: mp2@2ch)","佛山公共高清,http://faim.top:12306/rtp/239.253.43.53:5146"]
["239.77.0.129:5146","HD (V: h264; A: mp2@2ch)",null,null,"239.77.0.236:5146","239.77.0.236:5146","SD (V: h264; A: mp2@2ch)","佛山南海,http://faim.top:12306/rtp/239.77.0.236:5146"]
["239.77.0.130:5146","HD (V: mpeg2video; A: ac3@2ch)",null,null,"239.253.43.54:5146","239.253.43.54:5146","HD (V: h264; A: mp2@2ch)","佛山南海高清,http://faim.top:12306/rtp/239.253.43.54:5146"]
["239.77.0.131:5146","HD (V: mpeg2video; A: ac3@2ch)",null,null,"239.253.43.55:5146","239.253.43.55:5146","HD (V: h264; A: mp2@2ch)","佛山顺德高清,http://faim.top:12306/rtp/239.253.43.55:5146"]
["239.77.0.132:5146","HD (V: cavs; A: mp2@2ch, ac3@6ch)",null,null,"239.253.43.56:5146","239.253.43.56:5146","HD (V: h264; A: mp2@2ch)","佛山影视高清,http://faim.top:12306/rtp/239.253.43.56:5146"]
["239.77.0.133:5146","HD (V: h264; A: mp2@2ch)",null,null,"239.253.43.57:5146","239.253.43.57:5146","HD (V: h264; A: mp2@2ch)","佛山综合高清,http://faim.top:12306/rtp/239.253.43.57:5146"]
["239.77.0.134:5146","HD (V: h264; A: mp2@2ch)",null,null,"239.253.43.104:5146","239.253.43.104:5146","HD (V: h264; A: mp2@2ch)","东莞新闻综合高清,http://faim.top:12306/rtp/239.253.43.104:5146"]
["239.77.0.135:5146","HD (V: h264; A: mp2@2ch)",null,null,"239.253.43.105:5146","239.253.43.105:5146","HD (V: h264; A: mp2@2ch)","东莞生活资讯高清,http://faim.top:12306/rtp/239.253.43.105:5146"]
["239.77.0.136:5146","HD (V: h264; A: mp2@2ch)",null,null,"239.77.0.185:5146","239.77.0.185:5146","HD (V: h264; A: mp2@2ch)","中山综合高清,http://faim.top:12306/rtp/239.77.0.185:5146"]
["239.77.0.137:5146","HD (V: h264; A: mp2@2ch)",null,null,"239.253.43.62:5146","239.253.43.62:5146","HD (V: h264; A: mp2@2ch)","中山综合高清,http://faim.top:12306/rtp/239.253.43.62:5146"]
["239.77.0.138:5146","HD (V: h264; A: mp2@2ch)",null,null,"239.253.43.63:5146","239.253.43.63:5146","HD (V: h264; A: mp2@2ch)","香山文化高清,http://faim.top:12306/rtp/239.253.43.63:5146"]
["239.77.0.139:5146","HD (V: h264; A: mp2@2ch)",null,null,"239.253.43.70:5146","239.253.43.70:5146","HD (V: h264; A: mp2@2ch)","潮州综合高清,http://faim.top:12306/rtp/239.253.43.70:5146"]
["239.77.0.140:5146","HD (V: h264; A: mp2@2ch)",null,null,"239.253.43.75:5146","239.253.43.75:5146","HD (V: h264; A: mp2@2ch)","潮州民生高清,http://faim.top:12306/rtp/239.253.43.75:5146"]
["239.77.0.141:5146","HD (V: h264; A: mp2@2ch)",null,null,"239.253.43.123:5146","239.253.43.123:5146","HD (V: h264; A: mp2@2ch)","梅州综合高清,http://faim.top:12306/rtp/239.253.43.123:5146"]
["239.77.0.145:5146","HD (V: h264; A: mp2@2ch)",null,null,"239.253.43.124:5146","239.253.43.124:5146","HD (V: h264; A: mp2@2ch)","客家生活高清,http://faim.top:12306/rtp/239.253.43.124:5146"]
["239.77.0.146:5146","HD (V: h264; A: mp2@2ch)",null,null,"239.253.43.82:5146","239.253.43.82:5146","HD (V: h264; A: mp2@2ch)","阳江-1高清,http://faim.top:12306/rtp/239.253.43.82:5146"]
["239.77.0.148:5146","HD (V: h264; A: mp2@2ch)",null,null,"239.253.43.83:5146","239.253.43.83:5146","HD (V: h264; A: mp2@2ch)","阳江-2高清,http://faim.top:12306/rtp/239.253.43.83:5146"]
["239.77.0.149:5146","HD (V: h264; A: mp2@2ch)",null,null,"239.77.0.14:5146","239.77.0.14:5146","SD (V: h264; A: mp2@2ch)","CCTV-1,http://faim.top:12306/rtp/239.77.0.14:5146"]
["239.77.0.150:5146","HD (V: h264; A: mp2@2ch)",null,null,"239.77.0.30:5146","239.77.0.30:5146","SD (V: h264; A: mp2@2ch)","CCTV-1综合,http://faim.top:12306/rtp/239.77.0.30:5146"]
["239.77.0.153:5146","SD (V: h264; A: mp2@2ch)",null,null,"239.77.1.17:5146","239.77.1.17:5146","HD (V: h264; A: mp2@2ch)","CCTV-1高清,http://faim.top:12306/rtp/239.77.1.17:5146"]
["239.77.0.155:5146","HD (V: h264; A: mp2@2ch)",null,null,"239.77.1.144:5146","239.77.1.144:5146","HD (V: h264; A: mp2@2ch)","CCTV-1高清,http://faim.top:12306/rtp/239.77.1.144:5146"]
["239.77.0.159:5146","HD (V: h264; A: mp2@2ch)",null,null,"239.77.1.76:5146","239.77.1.76:5146","HD (V: h264; A: mp2@2ch)","CCTV-1高清,http://faim.top:12306/rtp/239.77.1.76:5146"]
["239.77.0.160:5146","HD (V: h264; A: mp2@2ch)",null,null,"239.77.0.119:5146","239.77.0.119:5146","HD (V: h264; A: mp2@2ch)","CCTV-1高清,http://faim.top:12306/rtp/239.77.0.119:5146"]
["239.77.0.161:5146","HD (V: cavs; A: ac3@6ch)",null,null,"239.77.0.86:5146","239.77.0.86:5146","HD (V: h264; A: mp2@2ch)","CCTV-1高清(CCTV -1综合高清),http://faim.top:12306/rtp/239.77.0.86:5146"]
["239.77.0.162:5146","HD (V: cavs; A: ac3@6ch)",null,null,"239.77.0.129:5146","239.77.0.129:5146","HD (V: h264; A: mp2@2ch)","CCTV-1超清,http://faim.top:12306/rtp/239.77.0.129:5146"]
["239.77.0.163:5146","HD (V: cavs; A: ac3@6ch)",null,null,"239.77.0.31:5146","239.77.0.31:5146","SD (V: h264; A: mp2@2ch)","CCTV-2财经,http://faim.top:12306/rtp/239.77.0.31:5146"]
["239.77.0.164:5146","HD (V: h264; A: mp2@2ch)",null,null,"239.77.1.158:5146","239.77.1.158:5146","HD (V: h264; A: mp2@2ch)","CCTV-2高清,http://faim.top:12306/rtp/239.77.1.158:5146"]
["239.77.0.165:5146","HD (V: h264; A: mp2@2ch)",null,null,"239.253.43.17:5146","239.253.43.17:5146","HD (V: cavs; A: ac3@6ch)","CCTV-2高清 (CAVS),http://faim.top:12306/rtp/239.253.43.17:5146"]
["239.77.0.166:5146","HD (V: h264; A: mp2@2ch)",null,null,"239.77.0.137:5146","239.77.0.137:5146","HD (V: h264; A: mp2@2ch)","CCTV-2高清测试(CCTV -2财经高清),http://faim.top:12306/rtp/239.77.0.137:5146"]
["239.77.0.167:5146","HD (V: h264; A: mp2@2ch)",null,null,"239.77.0.32:5146","239.77.0.32:5146","SD (V: h264; A: mp2@2ch)","CCTV-3综艺,http://faim.top:12306/rtp/239.77.0.32:5146"]
["239.77.0.168:5146","HD (V: h264; A: mp2@2ch)",null,null,"239.77.0.169:5146","239.77.0.169:5146","HD (V: h264; A: mp2@2ch)","CCTV-3高清,http://faim.top:12306/rtp/239.77.0.169:5146"]
["239.77.0.169:5146","HD (V: h264; A: mp2@2ch)",null,null,"239.77.0.175:5146","239.77.0.175:5146","HD (V: cavs; A: ac3@6ch)","CCTV-3超清 (CAVS),http://faim.top:12306/rtp/239.77.0.175:5146"]
["239.77.0.170:5146","HD (V: h264; A: mp2@2ch)",null,null,"239.77.0.33:5146","239.77.0.33:5146","SD (V: h264; A: mp2@2ch)","CCTV-4中文国际,http://faim.top:12306/rtp/239.77.0.33:5146"]
["239.77.0.171:5146","HD (V: h264; A: mp2@2ch)",null,null,"239.77.1.163:5146","239.77.1.163:5146","HD (V: h264; A: mp2@2ch)","CCTV-4高清,http://faim.top:12306/rtp/239.77.1.163:5146"]
["239.77.0.172:5146","HD (V: h264; A: mp2@2ch)",null,null,"239.77.1.166:5146","239.77.1.166:5146","HD (V: h264; A: ac3@6ch)","CCTV-4高清,http://faim.top:12306/rtp/239.77.1.166:5146"]
["239.77.0.173:5146","HD (V: h264; A: mp2@2ch)",null,null,"239.77.0.78:5146","239.77.0.78:5146","HD (V: h264; A: mp2@2ch)","CCTV-4高清,http://faim.top:12306/rtp/239.77.0.78:5146"]
["239.77.0.174:5146","4K (V: hevc; A: aac@2ch)",null,null,"239.253.43.121:5146","239.253.43.121:5146","HD (V: h264; A: mp2@2ch)","CCTV-4美洲高清,http://faim.top:12306/rtp/239.253.43.121:5146"]
["239.77.0.175:5146","HD (V: cavs; A: ac3@6ch)",null,null,"239.253.43.120:5146","239.253.43.120:5146","HD (V: h264; A: mp2@2ch)","CCTV-4欧洲高清,http://faim.top:12306/rtp/239.253.43.120:5146"]
["239.77.0.176:5146","HD (V: h264; A: mp2@2ch)",null,null,"239.77.0.34:5146","239.77.0.34:5146","SD (V: h264; A: mp2@2ch)","CCTV-5体育,http://faim.top:12306/rtp/239.77.0.34:5146"]
["239.77.0.177:5146","HD (V: cavs; A: ac3@6ch)",null,null,"239.77.0.170:5146","239.77.0.170:5146","HD (V: h264; A: mp2@2ch)","CCTV-5高清,http://faim.top:12306/rtp/239.77.0.170:5146"]
["239.77.0.178:5146","HD (V: cavs; A: ac3@2ch)",null,null,"239.77.0.177:5146","239.77.0.177:5146","HD (V: cavs; A: ac3@6ch)","CCTV-5超清 (CAVS),http://faim.top:12306/rtp/239.77.0.177:5146"]
["239.77.0.179:5146","HD (V: h264; A: mp2@2ch)",null,null,"239.77.0.87:5146","239.77.0.87:5146","HD (V: h264; A: mp2@2ch)","CCTV-5+高清,http://faim.top:12306/rtp/239.77.0.87:5146"]
["239.77.0.180:5146","HD (V: h264; A: mp2@2ch)",null,null,"239.77.1.31:5146","239.77.1.31:5146","HD (V: h264; A: mp2@2ch)","CCTV-5+高清,http://faim.top:12306/rtp/239.77.1.31:5146"]
["239.77.0.181:5146","HD (V: cavs; A: ac3@6ch)",null,null,"239.77.1.147:5146","239.77.1.147:5146"," (; )","CCTV-5+高清,http://faim.top:12306/rtp/239.77.1.147:5146"]
["239.77.0.182:5146","HD (V: h264; A: mp2@2ch)",null,null,"239.77.0.35:5146","239.77.0.35:5146","SD (V: h264; A: mp2@2ch)","CCTV-6电影,http://faim.top:12306/rtp/239.77.0.35:5146"]
["239.77.0.183:5146","HD (V: h264; A: mp2@2ch)",null,null,"239.77.0.171:5146","239.77.0.171:5146","HD (V: h264; A: mp2@2ch)","CCTV-6高清,http://faim.top:12306/rtp/239.77.0.171:5146"]
["239.77.0.185:5146","HD (V: h264; A: mp2@2ch)",null,null,"239.77.0.178:5146","239.77.0.178:5146","HD (V: cavs; A: ac3@2ch)","CCTV-6超清 (CAVS),http://faim.top:12306/rtp/239.77.0.178:5146"]
["239.77.0.186:5146","SD (V: h264; A: mp2@2ch)",null,null,"239.77.0.36:5146","239.77.0.36:5146","SD (V: h264; A: mp2@2ch)","CCTV-7国防军事,http://faim.top:12306/rtp/239.77.0.36:5146"]
["239.77.0.187:5146","HD (V: h264; A: mp2@2ch)",null,null,"239.77.1.159:5146","239.77.1.159:5146","HD (V: h264; A: mp2@2ch)","CCTV-7高清,http://faim.top:12306/rtp/239.77.1.159:5146"]
["239.77.0.188:5146","HD (V: h264; A: mp2@2ch)",null,null,{"$f":"VLOOKUP(F131,A:A,1,0)","v":"239.77.1.167:5146"},{"$f":"MID(H131,FIND(\"/rtp/\",H131)+5,LEN(H131)-FIND(\"/rtp/\",H131)-4)","v":"239.77.1.167:5146"},{"$f":"VLOOKUP(F131,A:B,2,0)","v":"HD (V: cavs; A: ac3@6ch)"},"CCTV-7高清 (CAVS),http://faim.top:12306/rtp/239.77.1.167:5146"]
["239.77.0.189:5146","HD (V: h264; A: mp2@2ch)",null,null,"239.77.0.138:5146","239.77.0.138:5146","HD (V: h264; A: mp2@2ch)","CCTV-7高清测试(CCTV -7军事农业高清),http://faim.top:12306/rtp/239.77.0.138:5146"]
["239.77.0.190:5146","SD (V: h264; A: mp2@2ch)",null,null,"239.77.0.37:5146","239.77.0.37:5146","SD (V: h264; A: mp2@2ch)","CCTV-8电视剧,http://faim.top:12306/rtp/239.77.0.37:5146"]
["239.77.0.191:5146","SD (V: h264; A: mp2@2ch)",null,null,"239.77.0.172:5146","239.77.0.172:5146","HD (V: h264; A: mp2@2ch)","CCTV-8高清,http://faim.top:12306/rtp/239.77.0.172:5146"]
["239.77.0.193:5146","SD (V: h264; A: mp2@2ch)",null,null,"239.77.0.181:5146","239.77.0.181:5146","HD (V: cavs; A: ac3@6ch)","CCTV-8超清 (CAVS),http://faim.top:12306/rtp/239.77.0.181:5146"]
["239.77.0.194:5146","4K (V: hevc; A: aac@2ch)",null,null,"239.77.0.38:5146","239.77.0.38:5146","SD (V: h264; A: mp2@2ch)","CCTV-9纪录,http://faim.top:12306/rtp/239.77.0.38:5146"]
["239.77.0.198:5146","HD (V: h264; A: mp2@2ch)",null,null,"239.77.1.160:5146","239.77.1.160:5146","HD (V: h264; A: mp2@2ch)","CCTV-9高清,http://faim.top:12306/rtp/239.77.1.160:5146"]
["239.77.0.199:5146","HD (V: h264; A: mp2@2ch)",null,null,"239.77.1.168:5146","239.77.1.168:5146","HD (V: cavs; A: ac3@6ch)","CCTV-9高清 (CAVS),http://faim.top:12306/rtp/239.77.1.168:5146"]
["239.77.0.200:5146","HD (V: h264; A: mp2@2ch)",null,null,"239.77.0.135:5146","239.77.0.135:5146","HD (V: h264; A: mp2@2ch)","CCTV-9高清测试,http://faim.top:12306/rtp/239.77.0.135:5146"]
["239.77.0.201:5146","HD (V: h264; A: mp2@2ch)",null,null,"239.77.0.39:5146","239.77.0.39:5146","SD (V: h264; A: mp2@2ch)","CCTV-10科教,http://faim.top:12306/rtp/239.77.0.39:5146"]
["239.77.0.202:5146","HD (V: h264; A: mp2@2ch)",null,null,"239.77.1.113:5146","239.77.1.113:5146","HD (V: h264; A: mp2@2ch)","CCTV-10高清,http://faim.top:12306/rtp/239.77.1.113:5146"]
["239.77.0.206:5146","HD (V: h264; A: mp2@2ch)",null,null,"239.77.1.169:5146","239.77.1.169:5146","HD (V: cavs; A: ac3@6ch)","CCTV-10高清 (CAVS),http://faim.top:12306/rtp/239.77.1.169:5146"]
["239.77.0.207:5146","HD (V: h264; A: mp2@2ch)",null,null,"239.77.0.134:5146","239.77.0.134:5146","HD (V: h264; A: mp2@2ch)","CCTV-10高清测试(CCTV-10科教高清),http://faim.top:12306/rtp/239.77.0.134:5146"]
["239.77.0.209:5146","SD (V: h264; A: mp2@1ch)",null,null,"239.77.0.40:5146","239.77.0.40:5146","SD (V: h264; A: mp2@2ch)","CCTV-11戏曲,http://faim.top:12306/rtp/239.77.0.40:5146"]
["239.77.0.212:5146","HD (V: h264; A: mp2@2ch)",null,null,"239.77.1.42:5146","239.77.1.42:5146","SD (V: h264; A: mp2@2ch)","CCTV-11,http://faim.top:12306/rtp/239.77.1.42:5146"]
["239.77.0.213:5146","HD (V: h264; A: mp2@2ch)",null,null,"239.77.1.108:5146","239.77.1.108:5146","HD (V: h264; A: mp2@2ch)","CCTV-11高清,http://faim.top:12306/rtp/239.77.1.108:5146"]
["239.77.0.215:5146","HD (V: h264; A: mp2@2ch)",null,null,"239.77.1.238:5146","239.77.1.238:5146","HD (V: h264; A: mp2@2ch)","CCTV-11高清,http://faim.top:12306/rtp/239.77.1.238:5146"]
["239.77.0.217:5146","HD (V: h264; A: mp2@2ch)",null,null,"239.77.0.41:5146","239.77.0.41:5146","SD (V: h264; A: mp2@2ch)","CCTV-12社会与法,http://faim.top:12306/rtp/239.77.0.41:5146"]
["239.77.0.220:5146","SD (V: h264; A: mp2@1ch)",null,null,"239.77.1.109:5146","239.77.1.109:5146","HD (V: h264; A: mp2@2ch)","CCTV-12高清,http://faim.top:12306/rtp/239.77.1.109:5146"]
["239.77.0.221:5146","HD (V: h264; A: mp2@2ch)",null,null,"239.77.1.170:5146","239.77.1.170:5146","HD (V: cavs; A: ac3@6ch)","CCTV-12高清 (CAVS),http://faim.top:12306/rtp/239.77.1.170:5146"]
["239.77.0.222:5146","SD (V: h264; A: mp2@1ch)",null,null,"239.77.0.136:5146","239.77.0.136:5146","HD (V: h264; A: mp2@2ch)","CCTV-12高清测试,http://faim.top:12306/rtp/239.77.0.136:5146"]
["239.77.0.225:5146","HD (V: h264; A: mp2@2ch)",null,null,"239.77.0.42:5146","239.77.0.42:5146","SD (V: h264; A: mp2@2ch)","CCTV-13新闻,http://faim.top:12306/rtp/239.77.0.42:5146"]
["239.77.0.226:5146","SD (V: h264; A: mp2@1ch)",null,null,"239.77.0.188:5146","239.77.0.188:5146","HD (V: h264; A: mp2@2ch)","CCTV-13高清,http://faim.top:12306/rtp/239.77.0.188:5146"]
["239.77.0.228:5146","HD (V: h264; A: mp2@2ch)",null,null,"239.253.43.196:5146","239.253.43.196:5146","HD (V: h264; A: mp2@2ch)","CCTV-13高清,http://faim.top:12306/rtp/239.253.43.196:5146"]
["239.77.0.229:5146","HD (V: h264; A: mp2@2ch)",null,null,"239.77.0.43:5146","239.77.0.43:5146","SD (V: h264; A: mp2@2ch)","CCTV-14少儿,http://faim.top:12306/rtp/239.77.0.43:5146"]
["239.77.0.230:5146","HD (V: h264; A: mp2@2ch)",null,null,"239.77.1.161:5146","239.77.1.161:5146","HD (V: h264; A: mp2@2ch)","CCTV-14高清,http://faim.top:12306/rtp/239.77.1.161:5146"]
["239.77.0.232:5146","SD (V: h264; A: mp2@2ch)",null,null,"239.77.1.171:5146","239.77.1.171:5146","HD (V: cavs; A: ac3@6ch)","CCTV-14高清 (CAVS),http://faim.top:12306/rtp/239.77.1.171:5146"]
["239.77.0.233:5146","SD (V: h264; A: mp2@2ch)",null,null,"239.77.0.133:5146","239.77.0.133:5146","HD (V: h264; A: mp2@2ch)","CCTV-14高清测试,http://faim.top:12306/rtp/239.77.0.133:5146"]
["239.77.0.236:5146","SD (V: h264; A: mp2@2ch)",null,null,"239.77.0.44:5146","239.77.0.44:5146","SD (V: h264; A: mp2@2ch)","CCTV-15音乐,http://faim.top:12306/rtp/239.77.0.44:5146"]
["239.77.0.240:5146","SD (V: h264; A: mp2@2ch)",null,null,"239.77.1.11:5146","239.77.1.11:5146","SD (V: h264; A: mp2@2ch)","CCTV-15,http://faim.top:12306/rtp/239.77.1.11:5146"]
["239.77.0.241:5146","SD (V: h264; A: mp2@2ch)",null,null,"239.77.1.120:5146","239.77.1.120:5146","HD (V: h264; A: mp2@2ch)","CCTV-15高清,http://faim.top:12306/rtp/239.77.1.120:5146"]
["239.77.0.244:5146","4K (V: hevc; A: ac3@2ch)",null,null,"239.77.1.239:5146","239.77.1.239:5146","HD (V: h264; A: mp2@2ch)","CCTV-15高清,http://faim.top:12306/rtp/239.77.1.239:5146"]
["239.77.0.245:5146","4K (V: hevc; A: aac@2ch)",null,null,"239.77.0.165:5146","239.77.0.165:5146","HD (V: h264; A: mp2@2ch)","CCTV-16高清,http://faim.top:12306/rtp/239.77.0.165:5146"]
["239.77.0.250:5146","HD (V: h264; A: mp2@2ch)",null,null,"239.77.0.115:5146","239.77.0.115:5146","SD (V: h264; A: mp2@2ch)","CCTV-17农业,http://faim.top:12306/rtp/239.77.0.115:5146"]
["239.77.0.251:5146","HD (V: h264; A: mp2@2ch)",null,null,"239.77.1.121:5146","239.77.1.121:5146","HD (V: h264; A: mp2@2ch)","CCTV-17高清,http://faim.top:12306/rtp/239.77.1.121:5146"]
["239.77.0.252:5146","4K (V: avs2; A: ac3@6ch)",null,null,"239.77.0.198:5146","239.77.0.198:5146","HD (V: h264; A: mp2@2ch)","CCTV-17农业高清,http://faim.top:12306/rtp/239.77.0.198:5146"]
["239.77.0.253:5146","HD (V: h264; A: mp2@2ch)",null,null,"239.77.0.194:5146","239.77.0.194:5146","4K (V: hevc; A: aac@2ch)","CCTV-4K 4K,http://faim.top:12306/rtp/239.77.0.194:5146"]
["239.77.0.254:5146","HD (V: h264; A: mp2@2ch)",null,null,"239.77.0.174:5146","239.77.0.174:5146","4K (V: hevc; A: aac@2ch)","CCTV-4K 4K50p,http://faim.top:12306/rtp/239.77.0.174:5146"]
["239.77.1.2:5146","HD (V: h264; A: mp2@2ch)",null,null,"239.77.1.180:5146","239.77.1.180:5146","4K (V: hevc; A: aac@2ch)","CCTV-4K 4K,http://faim.top:12306/rtp/239.77.1.180:5146"]
["239.77.1.3:5146","HD (V: h264; A: mp2@2ch)",null,null,"239.77.0.45:5146","239.77.0.45:5146","SD (V: h264; A: mp2@2ch)","CGTN,http://faim.top:12306/rtp/239.77.0.45:5146"]
["239.77.1.4:5146","HD (V: h264; A: mp2@2ch)",null,null,"239.77.1.27:5146","239.77.1.27:5146","SD (V: h264; A: mp2@2ch)","CGTN,http://faim.top:12306/rtp/239.77.1.27:5146"]
["239.77.1.5:5146","HD (V: h264; A: mp2@2ch)",null,null,"239.77.0.199:5146","239.77.0.199:5146","HD (V: h264; A: mp2@2ch)","CGTN英语高清,http://faim.top:12306/rtp/239.77.0.199:5146"]
["239.77.1.6:5146","HD (V: h264; A: mp2@2ch)",null,null,"239.253.43.122:5146","239.253.43.122:5146","HD (V: h264; A: mp2@2ch)","CGTN Documentary高清,http://faim.top:12306/rtp/239.253.43.122:5146"]
["239.77.1.7:5146","HD (V: h264; A: mp2@2ch)",null,null,"239.77.0.221:5146","239.77.0.221:5146","HD (V: h264; A: mp2@2ch)","CGTN西班牙语高清,http://faim.top:12306/rtp/239.77.0.221:5146"]
["239.77.1.8:5146","HD (V: h264; A: mp2@2ch)",null,null,"239.77.0.228:5146","239.77.0.228:5146","HD (V: h264; A: mp2@2ch)","CGTN法语高清,http://faim.top:12306/rtp/239.77.0.228:5146"]
["239.77.1.9:5146","HD (V: h264; A: mp2@2ch)",null,null,"239.253.43.200:5146","239.253.43.200:5146","HD (V: h264; A: mp2@2ch)","CGTN阿拉伯语高清,http://faim.top:12306/rtp/239.253.43.200:5146"]
["239.77.1.10:5146","HD (V: h264; A: mp2@2ch)",null,null,"239.253.43.201:5146","239.253.43.201:5146","HD (V: h264; A: mp2@2ch)","CGTN俄语高清,http://faim.top:12306/rtp/239.253.43.201:5146"]
["239.77.1.11:5146","SD (V: h264; A: mp2@2ch)",null,null,"239.77.1.5:5146","239.77.1.5:5146","HD (V: h264; A: mp2@2ch)","湖南卫视高清,http://faim.top:12306/rtp/239.77.1.5:5146"]
["239.77.1.12:5146","SD (V: h264; A: mp2@2ch)",null,null,"239.77.1.129:5146","239.77.1.129:5146","HD (V: cavs; A: eac3@6ch)","湖南卫视高清 (CAVS),http://faim.top:12306/rtp/239.77.1.129:5146"]
["239.77.1.13:5146","4K (V: hevc; A: ac3@6ch)",null,null,"239.77.0.88:5146","239.77.0.88:5146","HD (V: h264; A: mp2@2ch)","湖南卫视高清,http://faim.top:12306/rtp/239.77.0.88:5146"]
["239.77.1.14:5146","4K (V: hevc; A: ac3@6ch)",null,null,"239.77.0.127:5146","239.77.0.127:5146","HD (V: cavs; A: eac3@6ch, ac3@6ch)","湖南卫视超清 (CAVS),http://faim.top:12306/rtp/239.77.0.127:5146"]
["239.77.1.15:5146","SD (V: h264; A: mp2@2ch)",null,null,"239.77.1.33:5146","239.77.1.33:5146","HD (V: h264; A: mp2@2ch)","浙江卫视高清,http://faim.top:12306/rtp/239.77.1.33:5146"]
["239.77.1.17:5146","HD (V: h264; A: mp2@2ch)",null,null,"239.77.1.150:5146","239.77.1.150:5146","HD (V: cavs; A: ac3@6ch)","浙江卫视高清 (CAVS),http://faim.top:12306/rtp/239.77.1.150:5146"]
["239.77.1.18:5146","HD (V: h264; A: mp2@2ch)",null,null,"239.77.0.89:5146","239.77.0.89:5146","HD (V: h264; A: mp2@2ch)","浙江卫视高清,http://faim.top:12306/rtp/239.77.0.89:5146"]
["239.77.1.19:5146","HD (V: h264; A: mp2@2ch)",null,null,"239.77.0.125:5146","239.77.0.125:5146","HD (V: cavs; A: ac3@6ch)","浙江卫视超清 (CAVS),http://faim.top:12306/rtp/239.77.0.125:5146"]
["239.77.1.20:5146","HD (V: h264; A: mp2@2ch)",null,null,"239.77.1.18:5146","239.77.1.18:5146","HD (V: h264; A: mp2@2ch)","江苏卫视高清,http://faim.top:12306/rtp/239.77.1.18:5146"]
["239.77.1.21:5146","HD (V: h264; A: mp2@2ch)",null,null,"239.77.1.149:5146","239.77.1.149:5146","HD (V: cavs; A: ac3@6ch)","江苏卫视高清 (CAVS),http://faim.top:12306/rtp/239.77.1.149:5146"]
["239.77.1.22:5146","HD (V: h264; A: mp2@2ch)",null,null,"239.77.0.90:5146","239.77.0.90:5146","HD (V: h264; A: mp2@2ch)","江苏卫视高清,http://faim.top:12306/rtp/239.77.0.90:5146"]
["239.77.1.23:5146","HD (V: h264; A: mp2@2ch)",null,null,"239.77.0.126:5146","239.77.0.126:5146","HD (V: cavs; A: ac3@6ch)","江苏卫视超清 (CAVS),http://faim.top:12306/rtp/239.77.0.126:5146"]
["239.77.1.27:5146","SD (V: h264; A: mp2@2ch)",null,null,"239.77.1.218:5146","239.77.1.218:5146","HD (V: h264; A: mp2@2ch)","东方卫视高清,http://faim.top:12306/rtp/239.77.1.218:5146"]
["239.77.1.31:5146","HD (V: h264; A: mp2@2ch)",null,null,"239.77.1.156:5146","239.77.1.156:5146","HD (V: cavs; A: eac3@6ch)","东方卫视高清 (CAVS),http://faim.top:12306/rtp/239.77.1.156:5146"]
["239.77.1.33:5146","HD (V: h264; A: mp2@2ch)",null,null,"239.77.0.98:5146","239.77.0.98:5146","HD (V: h264; A: mp2@2ch)","东方卫视高清,http://faim.top:12306/rtp/239.77.0.98:5146"]
["239.77.1.35:5146","SD (V: h264; A: mp2@2ch)",null,null,"239.77.1.92:5146","239.77.1.92:5146","HD (V: h264; A: mp2@2ch)","安徽卫视高清,http://faim.top:12306/rtp/239.77.1.92:5146"]
["239.77.1.42:5146","SD (V: h264; A: mp2@2ch)",null,null,"239.77.1.157:5146","239.77.1.157:5146","HD (V: cavs; A: ac3@2ch)","安徽卫视高清 (CAVS),http://faim.top:12306/rtp/239.77.1.157:5146"]
["239.77.1.47:5146","SD (V: h264; A: mp2@2ch)",null,null,{"$f":"VLOOKUP(F195,A:A,1,0)","v":"239.77.0.183:5146"},{"$f":"MID(H195,FIND(\"/rtp/\",H195)+5,LEN(H195)-FIND(\"/rtp/\",H195)-4)","v":"239.77.0.183:5146"},{"$f":"VLOOKUP(F195,A:B,2,0)","v":"HD (V: h264; A: mp2@2ch)"},"安徽卫视高清,http://faim.top:12306/rtp/239.77.0.183:5146"]
["239.77.1.49:5146","SD (V: h264; A: mp2@2ch)",null,null,"239.77.1.4:5146","239.77.1.4:5146","HD (V: h264; A: mp2@2ch)","北京卫视高清,http://faim.top:12306/rtp/239.77.1.4:5146"]
["239.77.1.50:5146","SD (V: h264; A: mp2@2ch)",null,null,"239.77.1.151:5146","239.77.1.151:5146","HD (V: mpeg2video; A: ac3@6ch)","北京卫视高清,http://faim.top:12306/rtp/239.77.1.151:5146"]
["239.77.1.52:5146","SD (V: h264; A: mp2@2ch)",null,null,"239.77.0.91:5146","239.77.0.91:5146","HD (V: h264; A: mp2@2ch)","北京卫视高清,http://faim.top:12306/rtp/239.77.0.91:5146"]
["239.77.1.53:5146","SD (V: h264; A: mp2@2ch)",null,null,"239.77.0.2:5146","239.77.0.2:5146","4K (V: hevc; A: aac@2ch)","北京卫视 4K,http://faim.top:12306/rtp/239.77.0.2:5146"]
["239.77.1.54:5146","SD (V: h264; A: mp2@2ch)",null,null,"239.77.1.141:5146","239.77.1.141:5146","HD (V: h264; A: mp2@2ch)","天津卫视高清,http://faim.top:12306/rtp/239.77.1.141:5146"]
["239.77.1.55:5146","SD (V: h264; A: mp2@2ch)",null,null,"239.77.1.182:5146","239.77.1.182:5146","HD (V: mpeg2video; A: ac3@2ch)","天津卫视高清,http://faim.top:12306/rtp/239.77.1.182:5146"]
["239.77.1.57:5146","SD (V: h264; A: mp2@2ch)",null,null,"239.77.0.97:5146","239.77.0.97:5146","HD (V: h264; A: mp2@2ch)","天津卫视高清,http://faim.top:12306/rtp/239.77.0.97:5146"]
["239.77.1.67:5146","HD (V: h264; A: mp2@2ch)",null,null,"239.77.0.131:5146","239.77.0.131:5146","HD (V: mpeg2video; A: ac3@2ch)","天津卫视超清,http://faim.top:12306/rtp/239.77.0.131:5146"]
["239.77.1.69:5146","SD (V: h264; A: mp2@2ch)",null,null,"239.77.1.142:5146","239.77.1.142:5146","HD (V: h264; A: mp2@2ch)","山东卫视高清,http://faim.top:12306/rtp/239.77.1.142:5146"]
["239.77.1.70:5146","SD (V: h264; A: mp2@2ch)",null,null,"239.77.1.153:5146","239.77.1.153:5146","HD (V: cavs; A: ac3@6ch)","山东卫视高清 (CAVS),http://faim.top:12306/rtp/239.77.1.153:5146"]
["239.77.1.74:5146","SD (V: h264; A: mp2@2ch)",null,null,"239.77.0.94:5146","239.77.0.94:5146","HD (V: h264; A: mp2@2ch)","山东卫视高清,http://faim.top:12306/rtp/239.77.0.94:5146"]
["239.77.1.76:5146","HD (V: h264; A: mp2@2ch)",null,null,"239.77.0.132:5146","239.77.0.132:5146","HD (V: cavs; A: mp2@2ch, ac3@6ch)","山东卫视超清 (CAVS),http://faim.top:12306/rtp/239.77.0.132:5146"]
["239.77.1.77:5146","HD (V: h264; A: mp2@2ch)",null,null,"239.77.1.219:5146","239.77.1.219:5146","HD (V: h264; A: mp2@2ch)","江西卫视高清,http://faim.top:12306/rtp/239.77.1.219:5146"]
["239.77.1.78:5146","HD (V: h264; A: mp2@2ch)",null,null,"239.77.0.149:5146","239.77.0.149:5146","HD (V: h264; A: mp2@2ch)","江西卫视高清,http://faim.top:12306/rtp/239.77.0.149:5146"]
["239.77.1.79:5146","SD (V: h264; A: mp2@2ch)",null,null,"239.77.1.93:5146","239.77.1.93:5146","HD (V: h264; A: mp2@2ch)","湖北卫视高清,http://faim.top:12306/rtp/239.77.1.93:5146"]
["239.77.1.80:5146","SD (V: h264; A: mp2@2ch)",null,null,"239.77.1.174:5146","239.77.1.174:5146","HD (V: mpeg2video; A: ac3@2ch)","湖北卫视高清,http://faim.top:12306/rtp/239.77.1.174:5146"]
["239.77.1.82:5146","HD (V: h264; A: mp2@2ch)",null,null,"239.77.0.95:5146","239.77.0.95:5146","HD (V: h264; A: mp2@2ch)","湖北卫视高清,http://faim.top:12306/rtp/239.77.0.95:5146"]
["239.77.1.83:5146","HD (V: h264; A: mp2@2ch)",null,null,"239.77.0.128:5146","239.77.0.128:5146","HD (V: mpeg2video; A: ac3@2ch)","湖北卫视超清,http://faim.top:12306/rtp/239.77.0.128:5146"]
["239.77.1.84:5146","HD (V: h264; A: mp2@2ch)",null,null,"239.77.1.103:5146","239.77.1.103:5146","HD (V: h264; A: mp2@2ch)","辽宁卫视高清,http://faim.top:12306/rtp/239.77.1.103:5146"]
["239.77.1.85:5146","HD (V: h264; A: mp2@2ch)",null,null,"239.77.0.123:5146","239.77.0.123:5146","HD (V: h264; A: mp2@2ch)","辽宁卫视 高清,http://faim.top:12306/rtp/239.77.0.123:5146"]
["239.77.1.86:5146","HD (V: h264; A: mp2@2ch)",null,null,"239.77.0.161:5146","239.77.0.161:5146","HD (V: cavs; A: ac3@6ch)","辽宁卫视超清 (CAVS),http://faim.top:12306/rtp/239.77.0.161:5146"]
["239.77.1.87:5146","HD (V: h264; A: mp2@2ch)",null,null,"239.77.1.6:5146","239.77.1.6:5146","HD (V: h264; A: mp2@2ch)","黑龙江卫视高清,http://faim.top:12306/rtp/239.77.1.6:5146"]
["239.77.1.88:5146","HD (V: h264; A: mp2@2ch)",null,null,"239.77.1.179:5146","239.77.1.179:5146","HD (V: mpeg2video; A: ac3@2ch)","黑龙江卫视高清,http://faim.top:12306/rtp/239.77.1.179:5146"]
["239.77.1.89:5146","HD (V: h264; A: mp2@2ch)",null,null,"239.77.0.93:5146","239.77.0.93:5146","HD (V: h264; A: mp2@2ch)","黑龙江卫视高清,http://faim.top:12306/rtp/239.77.0.93:5146"]
["239.77.1.90:5146","HD (V: h264; A: mp2@2ch)",null,null,"239.77.0.124:5146","239.77.0.124:5146","HD (V: mpeg2video; A: ac3@2ch, mp2@2ch)","黑龙江卫视超清,http://faim.top:12306/rtp/239.77.0.124:5146"]
["239.77.1.91:5146","HD (V: h264; A: mp2@2ch)",null,null,"239.77.1.221:5146","239.77.1.221:5146","HD (V: h264; A: mp2@2ch)","贵州卫视高清,http://faim.top:12306/rtp/239.77.1.221:5146"]
["239.77.1.92:5146","HD (V: h264; A: mp2@2ch)",null,null,"239.77.0.230:5146","239.77.0.230:5146","HD (V: h264; A: mp2@2ch)","贵州卫视高清,http://faim.top:12306/rtp/239.77.0.230:5146"]
["239.77.1.93:5146","HD (V: h264; A: mp2@2ch)",null,null,"239.77.1.215:5146","239.77.1.215:5146","HD (V: h264; A: mp2@2ch)","四川卫视高清,http://faim.top:12306/rtp/239.77.1.215:5146"]
["239.77.1.94:5146","SD (V: h264; A: mp2@2ch)",null,null,"239.77.0.159:5146","239.77.0.159:5146","HD (V: h264; A: mp2@2ch)","四川卫视高清,http://faim.top:12306/rtp/239.77.0.159:5146"]
["239.77.1.97:5146","SD (V: h264; A: mp2@2ch)",null,null,"239.77.0.163:5146","239.77.0.163:5146","HD (V: cavs; A: ac3@6ch)","四川卫视超清 (CAVS),http://faim.top:12306/rtp/239.77.0.163:5146"]
["239.77.1.99:5146","SD (V: h264; A: mp2@2ch)",null,null,"239.77.1.229:5146","239.77.1.229:5146","HD (V: h264; A: mp2@2ch)","河南卫视高清,http://faim.top:12306/rtp/239.77.1.229:5146"]
["239.77.1.103:5146","HD (V: h264; A: mp2@2ch)",null,null,"239.77.0.17:5146","239.77.0.17:5146","HD (V: h264; A: mp2@2ch)","河南卫视高清,http://faim.top:12306/rtp/239.77.0.17:5146"]
["239.77.1.104:5146","HD (V: h264; A: mp2@2ch)",null,null,"239.253.43.37:5146","239.253.43.37:5146","HD (V: h264; A: mp2@2ch)","云南卫视高清,http://faim.top:12306/rtp/239.253.43.37:5146"]
["239.77.1.105:5146","SD (V: h264; A: mp2@2ch)",null,null,"239.253.43.100:5146","239.253.43.100:5146","HD (V: h264; A: mp2@2ch)","云南卫视高清,http://faim.top:12306/rtp/239.253.43.100:5146"]
["239.77.1.107:5146","HD (V: h264; A: ac3@6ch)",null,null,"239.77.1.162:5146","239.77.1.162:5146","HD (V: h264; A: mp2@2ch)","重庆卫视高清,http://faim.top:12306/rtp/239.77.1.162:5146"]
["239.77.1.108:5146","HD (V: h264; A: mp2@2ch)",null,null,"239.77.0.182:5146","239.77.0.182:5146","HD (V: h264; A: mp2@2ch)","重庆卫视高清,http://faim.top:12306/rtp/239.77.0.182:5146"]
["239.77.1.109:5146","HD (V: h264; A: mp2@2ch)",null,null,"239.77.1.214:5146","239.77.1.214:5146","HD (V: h264; A: mp2@2ch)","河北卫视高清,http://faim.top:12306/rtp/239.77.1.214:5146"]
["239.77.1.111:5146","HD (V: h264; A: mp2@2ch)",null,null,"239.77.0.148:5146","239.77.0.148:5146","HD (V: h264; A: mp2@2ch)","河北卫视高清,http://faim.top:12306/rtp/239.77.0.148:5146"]
["239.77.1.112:5146","SD (V: h264; A: mp2@2ch)",null,null,"239.77.1.104:5146","239.77.1.104:5146","HD (V: h264; A: mp2@2ch)","东南卫视高清,http://faim.top:12306/rtp/239.77.1.104:5146"]
["239.77.1.113:5146","HD (V: h264; A: mp2@2ch)",null,null,"239.77.0.146:5146","239.77.0.146:5146","HD (V: h264; A: mp2@2ch)","福建东南卫视高清,http://faim.top:12306/rtp/239.77.0.146:5146"]
["239.77.1.114:5146","HD (V: h264; A: mp2@2ch)",null,null,"239.253.43.36:5146","239.253.43.36:5146","HD (V: h264; A: mp2@2ch)","广西卫视高清,http://faim.top:12306/rtp/239.253.43.36:5146"]
["239.77.1.115:5146","SD (V: h264; A: mp2@2ch)",null,null,"239.77.0.139:5146","239.77.0.139:5146","HD (V: h264; A: mp2@2ch)","广西卫视高清,http://faim.top:12306/rtp/239.77.0.139:5146"]
["239.77.1.116:5146","HD (V: h264; A: mp2@2ch)",null,null,"239.77.1.111:5146","239.77.1.111:5146","HD (V: h264; A: mp2@2ch)","吉林卫视高清,http://faim.top:12306/rtp/239.77.1.111:5146"]
["239.77.1.117:5146","SD (V: h264; A: mp2@2ch)",null,null,"239.77.0.150:5146","239.77.0.150:5146","HD (V: h264; A: mp2@2ch)","吉林卫视高清,http://faim.top:12306/rtp/239.77.0.150:5146"]
["239.77.1.120:5146","HD (V: h264; A: mp2@2ch)",null,null,"239.77.0.68:5146","239.77.0.68:5146","SD (V: h264; A: mp2@2ch)","陕西卫视,http://faim.top:12306/rtp/239.77.0.68:5146"]
["239.77.1.121:5146","HD (V: h264; A: mp2@2ch)",null,null,"239.77.1.54:5146","239.77.1.54:5146","SD (V: h264; A: mp2@2ch)","陕西卫视,http://faim.top:12306/rtp/239.77.1.54:5146"]
["239.77.1.122:5146","HD (V: h264; A: mp2@2ch)",null,null,"239.77.0.69:5146","239.77.0.69:5146","SD (V: h264; A: mp2@2ch)","山西卫视,http://faim.top:12306/rtp/239.77.0.69:5146"]
["239.77.1.124:5146","HD (V: h264; A: mp2@2ch)",null,null,"239.77.1.74:5146","239.77.1.74:5146","SD (V: h264; A: mp2@2ch)","山西卫视,http://faim.top:12306/rtp/239.77.1.74:5146"]
["239.77.1.125:5146","HD (V: h264; A: mp2@2ch)",null,null,"239.77.0.70:5146","239.77.0.70:5146","SD (V: h264; A: mp2@2ch)","内蒙古卫视,http://faim.top:12306/rtp/239.77.0.70:5146"]
["239.77.1.128:5146","HD (V: h264; A: mp2@2ch)",null,null,"239.77.1.55:5146","239.77.1.55:5146","SD (V: h264; A: mp2@2ch)","内蒙古卫视,http://faim.top:12306/rtp/239.77.1.55:5146"]
["239.77.1.129:5146","HD (V: cavs; A: eac3@6ch)",null,null,"239.77.1.70:5146","239.77.1.70:5146","SD (V: h264; A: mp2@2ch)","青海卫视,http://faim.top:12306/rtp/239.77.1.70:5146"]
["239.77.1.130:5146","HD (V: h264; A: mp2@2ch)",null,null,"239.253.43.125:5146","239.253.43.125:5146","HD (V: h264; A: mp2@2ch)","青海卫视高清,http://faim.top:12306/rtp/239.253.43.125:5146"]
["239.77.1.131:5146","HD (V: h264; A: mp2@2ch)",null,null,"239.253.43.35:5146","239.253.43.35:5146","HD (V: h264; A: mp2@2ch)","海南卫视高清,http://faim.top:12306/rtp/239.253.43.35:5146"]
["239.77.1.132:5146"," (; )",null,null,"239.253.43.101:5146","239.253.43.101:5146","HD (V: h264; A: mp2@2ch)","海南卫视高清,http://faim.top:12306/rtp/239.253.43.101:5146"]
["239.77.1.138:5146","HD (V: h264; A: mp2@2ch)",null,null,"239.77.0.73:5146","239.77.0.73:5146","SD (V: h264; A: mp2@2ch)","宁夏卫视,http://faim.top:12306/rtp/239.77.0.73:5146"]
["239.77.1.139:5146","SD (V: h264; A: mp2@2ch)",null,null,"239.77.1.47:5146","239.77.1.47:5146","SD (V: h264; A: mp2@2ch)","宁夏卫视,http://faim.top:12306/rtp/239.77.1.47:5146"]
["239.77.1.140:5146","HD (V: h264; A: mp2@2ch)",null,null,"239.77.0.74:5146","239.77.0.74:5146","SD (V: h264; A: mp2@2ch)","西藏卫视,http://faim.top:12306/rtp/239.77.0.74:5146"]
["239.77.1.141:5146","HD (V: h264; A: mp2@2ch)",null,null,"239.77.1.49:5146","239.77.1.49:5146","SD (V: h264; A: mp2@2ch)","西藏卫视,http://faim.top:12306/rtp/239.77.1.49:5146"]
["239.77.1.142:5146","HD (V: h264; A: mp2@2ch)",null,null,"239.77.0.75:5146","239.77.0.75:5146","SD (V: h264; A: mp2@2ch)","新疆卫视,http://faim.top:12306/rtp/239.77.0.75:5146"]
["239.77.1.144:5146","HD (V: h264; A: mp2@2ch)",null,null,"239.77.1.53:5146","239.77.1.53:5146","SD (V: h264; A: mp2@2ch)","新疆卫视,http://faim.top:12306/rtp/239.77.1.53:5146"]
["239.77.1.147:5146"," (; )",null,null,"239.77.1.57:5146","239.77.1.57:5146","SD (V: h264; A: mp2@2ch)","甘肃卫视,http://faim.top:12306/rtp/239.77.1.57:5146"]
["239.77.1.148:5146","HD (V: h264; A: mp2@2ch)",null,null,"239.77.0.189:5146","239.77.0.189:5146","HD (V: h264; A: mp2@2ch)","甘肃卫视高清,http://faim.top:12306/rtp/239.77.0.189:5146"]
["239.77.1.149:5146","HD (V: cavs; A: ac3@6ch)",null,null,"239.77.0.77:5146","239.77.0.77:5146","SD (V: h264; A: mp2@2ch)","兵团卫视,http://faim.top:12306/rtp/239.77.0.77:5146"]
["239.77.1.150:5146","HD (V: cavs; A: ac3@6ch)",null,null,{"$f":"VLOOKUP(F259,A:A,1,0)","v":"239.77.1.80:5146"},{"$f":"MID(H259,FIND(\"/rtp/\",H259)+5,LEN(H259)-FIND(\"/rtp/\",H259)-4)","v":"239.77.1.80:5146"},{"$f":"VLOOKUP(F259,A:B,2,0)","v":"SD (V: h264; A: mp2@2ch)"},"兵团卫视,http://faim.top:12306/rtp/239.77.1.80:5146"]
["239.77.1.151:5146","HD (V: mpeg2video; A: ac3@6ch)",null,null,"239.77.0.96:5146","239.77.0.96:5146","SD (V: h264; A: mp2@2ch)","厦门卫视,http://faim.top:12306/rtp/239.77.0.96:5146"]
["239.77.1.152:5146","HD (V: mpeg2video; A: ac3@6ch)",null,null,"239.77.1.117:5146","239.77.1.117:5146","SD (V: h264; A: mp2@2ch)","三沙卫视,http://faim.top:12306/rtp/239.77.1.117:5146"]
["239.77.1.153:5146","HD (V: cavs; A: ac3@6ch)",null,null,"239.253.43.113:5146","239.253.43.113:5146","HD (V: h264; A: mp2@2ch)","三沙卫视高清,http://faim.top:12306/rtp/239.253.43.113:5146"]
["239.77.1.156:5146","HD (V: cavs; A: eac3@6ch)",null,null,"239.77.0.10:5146","239.77.0.10:5146","SD (V: h264; A: mp2@2ch)","吉林延边卫视,http://faim.top:12306/rtp/239.77.0.10:5146"]
["239.77.1.157:5146","HD (V: cavs; A: ac3@2ch)",null,null,"239.77.1.99:5146","239.77.1.99:5146","SD (V: h264; A: mp2@2ch)","延边卫视,http://faim.top:12306/rtp/239.77.1.99:5146"]
["239.77.1.158:5146","HD (V: h264; A: mp2@2ch)",null,null,"239.253.43.18:5146","239.253.43.18:5146","HD (V: h264; A: mp2@2ch)","兵器科技高清,http://faim.top:12306/rtp/239.253.43.18:5146"]
["239.77.1.159:5146","HD (V: h264; A: mp2@2ch)",null,null,"239.253.43.9:5146","239.253.43.9:5146","HD (V: h264; A: mp2@2ch)","兵器科技高清,http://faim.top:12306/rtp/239.253.43.9:5146"]
["239.77.1.160:5146","HD (V: h264; A: mp2@2ch)",null,null,"239.253.43.19:5146","239.253.43.19:5146","HD (V: h264; A: mp2@2ch)","电视指南高清,http://faim.top:12306/rtp/239.253.43.19:5146"]
["239.77.1.161:5146","HD (V: h264; A: mp2@2ch)",null,null,"239.253.43.10:5146","239.253.43.10:5146","HD (V: h264; A: mp2@2ch)","电视指南高清,http://faim.top:12306/rtp/239.253.43.10:5146"]
["239.77.1.162:5146","HD (V: h264; A: mp2@2ch)",null,null,"239.253.43.20:5146","239.253.43.20:5146","HD (V: h264; A: mp2@2ch)","风云足球高清,http://faim.top:12306/rtp/239.253.43.20:5146"]
["239.77.1.163:5146","HD (V: h264; A: mp2@2ch)",null,null,"239.253.43.14:5146","239.253.43.14:5146","HD (V: h264; A: mp2@2ch)","风云足球高清,http://faim.top:12306/rtp/239.253.43.14:5146"]
["239.77.1.166:5146","HD (V: h264; A: ac3@6ch)",null,null,"239.253.43.21:5146","239.253.43.21:5146","HD (V: h264; A: mp2@2ch)","央视台球高清,http://faim.top:12306/rtp/239.253.43.21:5146"]
["239.77.1.167:5146","HD (V: cavs; A: ac3@6ch)",null,null,"239.253.43.11:5146","239.253.43.11:5146","HD (V: h264; A: mp2@2ch)","央视台球高清,http://faim.top:12306/rtp/239.253.43.11:5146"]
["239.77.1.168:5146","HD (V: cavs; A: ac3@6ch)",null,null,"239.253.43.22:5146","239.253.43.22:5146","HD (V: h264; A: mp2@2ch)","高尔夫网球高清,http://faim.top:12306/rtp/239.253.43.22:5146"]
["239.77.1.169:5146","HD (V: cavs; A: ac3@6ch)",null,null,"239.253.43.12:5146","239.253.43.12:5146","HD (V: h264; A: mp2@2ch)","高尔夫网球高清,http://faim.top:12306/rtp/239.253.43.12:5146"]
["239.77.1.170:5146","HD (V: cavs; A: ac3@6ch)",null,null,"239.253.43.23:5146","239.253.43.23:5146","HD (V: h264; A: mp2@2ch)","女性时尚高清,http://faim.top:12306/rtp/239.253.43.23:5146"]
["239.77.1.171:5146","HD (V: cavs; A: ac3@6ch)",null,null,"239.253.43.8:5146","239.253.43.8:5146","HD (V: h264; A: mp2@2ch)","女性时尚高清,http://faim.top:12306/rtp/239.253.43.8:5146"]
["239.77.1.174:5146","HD (V: mpeg2video; A: ac3@2ch)",null,null,"239.253.43.24:5146","239.253.43.24:5146","HD (V: h264; A: mp2@2ch)","世界地理高清,http://faim.top:12306/rtp/239.253.43.24:5146"]
["239.77.1.175:5146","SD (V: h264; A: mp2@2ch)",null,null,"239.253.43.7:5146","239.253.43.7:5146","HD (V: h264; A: mp2@2ch)","世界地理高清,http://faim.top:12306/rtp/239.253.43.7:5146"]
["239.77.1.176:5146","HD (V: h264; A: mp2@2ch)",null,null,"239.253.43.25:5146","239.253.43.25:5146","HD (V: h264; A: mp2@2ch)","怀旧剧场高清,http://faim.top:12306/rtp/239.253.43.25:5146"]
["239.77.1.177:5146","HD (V: h264; A: mp2@2ch)",null,null,"239.253.43.5:5146","239.253.43.5:5146","HD (V: h264; A: mp2@2ch)","怀旧剧场高清,http://faim.top:12306/rtp/239.253.43.5:5146"]
["239.77.1.179:5146","HD (V: mpeg2video; A: ac3@2ch)",null,null,"239.253.43.26:5146","239.253.43.26:5146","HD (V: h264; A: mp2@2ch)","风云剧场高清,http://faim.top:12306/rtp/239.253.43.26:5146"]
["239.77.1.180:5146","4K (V: hevc; A: aac@2ch)",null,null,"239.253.43.16:5146","239.253.43.16:5146","HD (V: h264; A: mp2@2ch)","风云剧场高清,http://faim.top:12306/rtp/239.253.43.16:5146"]
["239.77.1.182:5146","HD (V: mpeg2video; A: ac3@2ch)",null,null,"239.253.43.27:5146","239.253.43.27:5146","HD (V: h264; A: mp2@2ch)","央视文化精品高清,http://faim.top:12306/rtp/239.253.43.27:5146"]
["239.77.1.183:5146","SD (V: h264; A: mp2@2ch)",null,null,"239.253.43.13:5146","239.253.43.13:5146","HD (V: h264; A: mp2@2ch)","央视文化精品高清,http://faim.top:12306/rtp/239.253.43.13:5146"]
["239.77.1.184:5146","SD (V: h264; A: mp2@2ch)",null,null,"239.253.43.28:5146","239.253.43.28:5146","HD (V: h264; A: mp2@2ch)","第一剧场高清,http://faim.top:12306/rtp/239.253.43.28:5146"]
["239.77.1.195:5146","SD (V: h264; A: mp2@2ch)",null,null,"239.253.43.15:5146","239.253.43.15:5146","HD (V: h264; A: mp2@2ch)","第一剧场高清,http://faim.top:12306/rtp/239.253.43.15:5146"]
["239.77.1.197:5146","SD (V: h264; A: mp2@1ch)",null,null,"239.253.43.29:5146","239.253.43.29:5146","HD (V: h264; A: mp2@2ch)","风云音乐高清,http://faim.top:12306/rtp/239.253.43.29:5146"]
["239.77.1.198:5146","SD (V: h264; A: mp2@2ch)",null,null,"239.253.43.6:5146","239.253.43.6:5146","HD (V: h264; A: mp2@2ch)","风云音乐高清,http://faim.top:12306/rtp/239.253.43.6:5146"]
["239.77.1.205:5146","SD (V: h264; A: mp2@2ch)",null,null,"239.77.0.212:5146","239.77.0.212:5146","HD (V: h264; A: mp2@2ch)","卫生健康高清,http://faim.top:12306/rtp/239.77.0.212:5146"]
["239.77.1.214:5146","HD (V: h264; A: mp2@2ch)",null,null,"239.77.0.220:5146","239.77.0.220:5146","SD (V: h264; A: mp2@1ch)","老故事,http://faim.top:12306/rtp/239.77.0.220:5146"]
["239.77.1.215:5146","HD (V: h264; A: mp2@2ch)",null,null,"239.77.1.197:5146","239.77.1.197:5146","SD (V: h264; A: mp2@1ch)","老故事,http://faim.top:12306/rtp/239.77.1.197:5146"]
["239.77.1.217:5146","HD (V: h264; A: mp2@2ch)",null,null,"239.77.1.195:5146","239.77.1.195:5146","SD (V: h264; A: mp2@2ch)","中学生,http://faim.top:12306/rtp/239.77.1.195:5146"]
["239.77.1.218:5146","HD (V: h264; A: mp2@2ch)",null,null,"239.77.1.112:5146","239.77.1.112:5146","SD (V: h264; A: mp2@2ch)","发现之旅,http://faim.top:12306/rtp/239.77.1.112:5146"]
["239.77.1.219:5146","HD (V: h264; A: mp2@2ch)",null,null,"239.253.43.127:5146","239.253.43.127:5146","SD (V: h264; A: mp2@1ch)","发现之旅,http://faim.top:12306/rtp/239.253.43.127:5146"]
["239.77.1.221:5146","HD (V: h264; A: mp2@2ch)",null,null,"239.77.0.79:5146","239.77.0.79:5146","SD (V: h264; A: mp2@2ch)","卡酷少儿,http://faim.top:12306/rtp/239.77.0.79:5146"]
["239.77.1.222:5146","HD (V: h264; A: mp2@2ch)",null,null,"239.77.1.50:5146","239.77.1.50:5146","SD (V: h264; A: mp2@2ch)","卡酷少儿,http://faim.top:12306/rtp/239.77.1.50:5146"]
["239.77.1.223:5146","HD (V: h264; A: mp2@2ch)",null,null,"239.77.1.52:5146","239.77.1.52:5146","SD (V: h264; A: mp2@2ch)","金鹰卡通,http://faim.top:12306/rtp/239.77.1.52:5146"]
["239.77.1.225:5146","SD (V: h264; A: mp2@2ch)",null,null,"239.77.0.164:5146","239.77.0.164:5146","HD (V: h264; A: mp2@2ch)","金鹰卡通高清,http://faim.top:12306/rtp/239.77.0.164:5146"]
["239.77.1.229:5146","HD (V: h264; A: mp2@2ch)",null,null,"239.77.0.81:5146","239.77.0.81:5146","SD (V: h264; A: mp2@1ch)","哈哈炫动,http://faim.top:12306/rtp/239.77.0.81:5146"]
["239.77.1.232:5146","HD (V: h264; A: mp2@2ch)",null,null,"239.77.1.139:5146","239.77.1.139:5146","SD (V: h264; A: mp2@2ch)","哈哈炫动,http://faim.top:12306/rtp/239.77.1.139:5146"]
["239.77.1.233:5146","HD (V: h264; A: mp2@2ch)",null,null,"239.77.0.222:5146","239.77.0.222:5146","SD (V: h264; A: mp2@1ch)","优漫卡通,http://faim.top:12306/rtp/239.77.0.222:5146"]
["239.77.1.234:5146","HD (V: h264; A: mp2@2ch, mp2@2ch, mp2@2ch, mp2@2ch)",null,null,"239.77.1.79:5146","239.77.1.79:5146","SD (V: h264; A: mp2@2ch)","优漫卡通,http://faim.top:12306/rtp/239.77.1.79:5146"]
["239.77.1.237:5146","4K (V: hevc; A: aac@2ch)",null,null,"239.77.1.222:5146","239.77.1.222:5146","HD (V: h264; A: mp2@2ch)","CETV-1高清,http://faim.top:12306/rtp/239.77.1.222:5146"]
["239.77.1.238:5146","HD (V: h264; A: mp2@2ch)",null,null,"239.77.0.200:5146","239.77.0.200:5146","HD (V: h264; A: mp2@2ch)","中国教育-1高清,http://faim.top:12306/rtp/239.77.0.200:5146"]
["239.77.1.239:5146","HD (V: h264; A: mp2@2ch)",null,null,"239.77.0.28:5146","239.77.0.28:5146","SD (V: h264; A: mp2@2ch)","CETV-2,http://faim.top:12306/rtp/239.77.0.28:5146"]
["239.77.1.242:5146","HD (V: h264; A: mp2@2ch)",null,null,"239.77.1.69:5146","239.77.1.69:5146","SD (V: h264; A: mp2@2ch)","CETV-2,http://faim.top:12306/rtp/239.77.1.69:5146"]
["239.77.1.244:5146","HD (V: h264; A: mp2@2ch)",null,null,"239.253.43.40:5146","239.253.43.40:5146","HD (V: h264; A: mp2@2ch)","CETV-4高清,http://faim.top:12306/rtp/239.253.43.40:5146"]
["239.253.43.1:5146","HD (V: h264; A: mp2@2ch)",null,null,"239.253.43.114:5146","239.253.43.114:5146","HD (V: h264; A: mp2@2ch)","CETV-4高清,http://faim.top:12306/rtp/239.253.43.114:5146"]
["239.253.43.2:5146","HD (V: h264; A: mp2@2ch)",null,null,"239.77.1.122:5146","239.77.1.122:5146","HD (V: h264; A: mp2@2ch)","早期教育高清,http://faim.top:12306/rtp/239.77.1.122:5146"]
["239.253.43.5:5146","HD (V: h264; A: mp2@2ch)",null,null,"239.77.0.180:5146","239.77.0.180:5146","HD (V: h264; A: mp2@2ch)","早期教育高清,http://faim.top:12306/rtp/239.77.0.180:5146"]
["239.253.43.6:5146","HD (V: h264; A: mp2@2ch)",null,null,"239.77.1.114:5146","239.77.1.114:5146","HD (V: h264; A: mp2@2ch)","早期教育高清,http://faim.top:12306/rtp/239.77.1.114:5146"]
["239.253.43.7:5146","HD (V: h264; A: mp2@2ch)",null,null,"239.77.0.83:5146","239.77.0.83:5146","SD (V: h264; A: mp2@1ch)","山东教育,http://faim.top:12306/rtp/239.77.0.83:5146"]
["239.253.43.8:5146","HD (V: h264; A: mp2@2ch)",null,null,"239.77.1.35:5146","239.77.1.35:5146","SD (V: h264; A: mp2@2ch)","山东教育卫视,http://faim.top:12306/rtp/239.77.1.35:5146"]
["239.253.43.9:5146","HD (V: h264; A: mp2@2ch)",null,null,"239.77.0.113:5146","239.77.0.113:5146","SD (V: h264; A: mp2@2ch)","财富天下,http://faim.top:12306/rtp/239.77.0.113:5146"]
["239.253.43.10:5146","HD (V: h264; A: mp2@2ch)",null,null,"239.77.1.2:5146","239.77.1.2:5146","HD (V: h264; A: mp2@2ch)","中国天气高清,http://faim.top:12306/rtp/239.77.1.2:5146"]
["239.253.43.11:5146","HD (V: h264; A: mp2@2ch)",null,null,"239.77.0.15:5146","239.77.0.15:5146","HD (V: h264; A: mp2@2ch)","茶,http://faim.top:12306/rtp/239.77.0.15:5146"]
["239.253.43.12:5146","HD (V: h264; A: mp2@2ch)",null,null,"239.77.0.145:5146","239.77.0.145:5146","HD (V: h264; A: mp2@2ch)","快乐垂钓,http://faim.top:12306/rtp/239.77.0.145:5146"]
["239.253.43.13:5146","HD (V: h264; A: mp2@2ch)",null,null,"239.77.1.217:5146","239.77.1.217:5146","HD (V: h264; A: mp2@2ch)","金鹰纪实高清,http://faim.top:12306/rtp/239.77.1.217:5146"]
["239.253.43.14:5146","HD (V: h264; A: mp2@2ch)",null,null,"239.77.0.160:5146","239.77.0.160:5146","HD (V: h264; A: mp2@2ch)","金鹰纪实高清测试,http://faim.top:12306/rtp/239.77.0.160:5146"]
["239.253.43.15:5146","HD (V: h264; A: mp2@2ch)",null,null,"239.77.0.162:5146","239.77.0.162:5146","HD (V: cavs; A: ac3@6ch)","金鹰纪实超清测试 (CAVS),http://faim.top:12306/rtp/239.77.0.162:5146"]
["239.253.43.16:5146","HD (V: h264; A: mp2@2ch)",null,null,"239.77.1.198:5146","239.77.1.198:5146","SD (V: h264; A: mp2@2ch)","环球奇观,http://faim.top:12306/rtp/239.77.1.198:5146"]
["239.253.43.17:5146","HD (V: cavs; A: ac3@6ch)",null,null,"239.253.43.126:5146","239.253.43.126:5146","SD (V: h264; A: mp2@1ch)","环球奇观,http://faim.top:12306/rtp/239.253.43.126:5146"]
["239.253.43.18:5146","HD (V: h264; A: mp2@2ch)",null,null,{"$f":"VLOOKUP(F323,A:A,1,0)","v":"239.77.1.115:5146"},{"$f":"MID(H323,FIND(\"/rtp/\",H323)+5,LEN(H323)-FIND(\"/rtp/\",H323)-4)","v":"239.77.1.115:5146"},{"$f":"VLOOKUP(F323,A:B,2,0)","v":"SD (V: h264; A: mp2@2ch)"},"书画频道,http://faim.top:12306/rtp/239.77.1.115:5146"]
["239.253.43.19:5146","HD (V: h264; A: mp2@2ch)",null,null,"239.77.0.21:5146","239.77.0.21:5146","HD (V: h264; A: mp2@2ch)","求索纪录高清,http://faim.top:12306/rtp/239.77.0.21:5146"]
["239.253.43.20:5146","HD (V: h264; A: mp2@2ch)",null,null,"239.77.0.226:5146","239.77.0.226:5146","SD (V: h264; A: mp2@1ch)","国学,http://faim.top:12306/rtp/239.77.0.226:5146"]
["239.253.43.21:5146","HD (V: h264; A: mp2@2ch)",null,null,"239.77.1.105:5146","239.77.1.105:5146","SD (V: h264; A: mp2@2ch)","国学频道,http://faim.top:12306/rtp/239.77.1.105:5146"]
["239.253.43.22:5146","HD (V: h264; A: mp2@2ch)",null,null,"239.77.0.209:5146","239.77.0.209:5146","SD (V: h264; A: mp2@1ch)","汽摩,http://faim.top:12306/rtp/239.77.0.209:5146"]
["239.253.43.23:5146","HD (V: h264; A: mp2@2ch)",null,null,"239.77.1.205:5146","239.77.1.205:5146","SD (V: h264; A: mp2@2ch)","汽摩,http://faim.top:12306/rtp/239.77.1.205:5146"]
["239.253.43.24:5146","HD (V: h264; A: mp2@2ch)",null,null,"239.253.43.98:5146","239.253.43.98:5146","HD (V: h264; A: mp2@2ch)","天元围棋,http://faim.top:12306/rtp/239.253.43.98:5146"]
["239.253.43.25:5146","HD (V: h264; A: mp2@2ch)",null,null,"239.77.1.22:5146","239.77.1.22:5146","HD (V: h264; A: mp2@2ch)","睛彩青少高清,http://faim.top:12306/rtp/239.77.1.22:5146"]
["239.253.43.26:5146","HD (V: h264; A: mp2@2ch)",null,null,"239.77.1.20:5146","239.77.1.20:5146","HD (V: h264; A: mp2@2ch)","睛彩竞技高清,http://faim.top:12306/rtp/239.77.1.20:5146"]
["239.253.43.27:5146","HD (V: h264; A: mp2@2ch)",null,null,"239.77.1.21:5146","239.77.1.21:5146","HD (V: h264; A: mp2@2ch)","睛彩篮球高清,http://faim.top:12306/rtp/239.77.1.21:5146"]
["239.253.43.28:5146","HD (V: h264; A: mp2@2ch)",null,null,"239.77.1.23:5146","239.77.1.23:5146","HD (V: h264; A: mp2@2ch)","睛彩广场舞高清,http://faim.top:12306/rtp/239.77.1.23:5146"]
["239.253.43.29:5146","HD (V: h264; A: mp2@2ch)",null,null,"239.77.1.7:5146","239.77.1.7:5146","HD (V: h264; A: mp2@2ch)","IPTV1高清,http://faim.top:12306/rtp/239.77.1.7:5146"]
["239.253.43.33:5146","HD (V: h264; A: mp2@2ch)",null,null,"239.77.1.8:5146","239.77.1.8:5146","HD (V: h264; A: mp2@2ch)","IPTV2高清,http://faim.top:12306/rtp/239.77.1.8:5146"]
["239.253.43.34:5146","HD (V: h264; A: mp2@2ch)",null,null,"239.77.0.107:5146","239.77.0.107:5146","HD (V: h264; A: mp2@2ch)","爱综艺,http://faim.top:12306/rtp/239.77.0.107:5146"]
["239.253.43.35:5146","HD (V: h264; A: mp2@2ch)",null,null,"239.77.1.78:5146","239.77.1.78:5146","HD (V: h264; A: mp2@2ch)","爱综艺,http://faim.top:12306/rtp/239.77.1.78:5146"]
["239.253.43.36:5146","HD (V: h264; A: mp2@2ch)",null,null,"239.77.1.9:5146","239.77.1.9:5146","HD (V: h264; A: mp2@2ch)","IPTV3高清,http://faim.top:12306/rtp/239.77.1.9:5146"]
["239.253.43.37:5146","HD (V: h264; A: mp2@2ch)",null,null,"239.77.1.10:5146","239.77.1.10:5146","HD (V: h264; A: mp2@2ch)","IPTV4高清,http://faim.top:12306/rtp/239.77.1.10:5146"]
["239.253.43.40:5146","HD (V: h264; A: mp2@2ch)",null,null,"239.77.0.108:5146","239.77.0.108:5146","HD (V: h264; A: mp2@2ch)","爱体育,http://faim.top:12306/rtp/239.77.0.108:5146"]
["239.253.43.45:5146","HD (V: h264; A: mp2@2ch)",null,null,"239.77.1.77:5146","239.77.1.77:5146","HD (V: h264; A: mp2@2ch)","爱体育,http://faim.top:12306/rtp/239.77.1.77:5146"]
["239.253.43.46:5146","HD (V: h264; A: mp2@2ch)",null,null,"239.77.0.176:5146","239.77.0.176:5146","HD (V: h264; A: mp2@2ch)","爱体育高清,http://faim.top:12306/rtp/239.77.0.176:5146"]
["239.253.43.53:5146","HD (V: h264; A: mp2@2ch)",null,null,"239.77.1.116:5146","239.77.1.116:5146","HD (V: h264; A: mp2@2ch)","爱体育高清,http://faim.top:12306/rtp/239.77.1.116:5146"]
["239.253.43.54:5146","HD (V: h264; A: mp2@2ch)",null,null,"239.77.0.103:5146","239.77.0.103:5146","HD (V: h264; A: mp2@2ch)","爱电影,http://faim.top:12306/rtp/239.77.0.103:5146"]
["239.253.43.55:5146","HD (V: h264; A: mp2@2ch)",null,null,"239.77.1.138:5146","239.77.1.138:5146","HD (V: h264; A: mp2@2ch)","爱电影,http://faim.top:12306/rtp/239.77.1.138:5146"]
["239.253.43.56:5146","HD (V: h264; A: mp2@2ch)",null,null,"239.77.0.105:5146","239.77.0.105:5146","HD (V: h264; A: mp2@2ch)","爱大剧,http://faim.top:12306/rtp/239.77.0.105:5146"]
["239.253.43.57:5146","HD (V: h264; A: mp2@2ch)",null,null,"239.77.1.82:5146","239.77.1.82:5146","HD (V: h264; A: mp2@2ch)","爱大剧,http://faim.top:12306/rtp/239.77.1.82:5146"]
["239.253.43.62:5146","HD (V: h264; A: mp2@2ch)",null,null,"239.77.0.99:5146","239.77.0.99:5146","HD (V: h264; A: mp2@2ch)","IPTV谍战剧场,http://faim.top:12306/rtp/239.77.0.99:5146"]
["239.253.43.63:5146","HD (V: h264; A: mp2@2ch)",null,null,"239.77.1.83:5146","239.77.1.83:5146","HD (V: h264; A: mp2@2ch)","IPTV谍战剧场,http://faim.top:12306/rtp/239.77.1.83:5146"]
["239.253.43.70:5146","HD (V: h264; A: mp2@2ch)",null,null,"239.77.0.100:5146","239.77.0.100:5146","HD (V: h264; A: mp2@2ch)","IPTV相声小品,http://faim.top:12306/rtp/239.77.0.100:5146"]
["239.253.43.71:5146","HD (V: h264; A: mp2@2ch)",null,null,"239.77.1.84:5146","239.77.1.84:5146","HD (V: h264; A: mp2@2ch)","IPTV相声小品,http://faim.top:12306/rtp/239.77.1.84:5146"]
["239.253.43.72:5146","HD (V: h264; A: mp2@2ch)",null,null,"239.77.0.101:5146","239.77.0.101:5146","HD (V: h264; A: mp2@2ch)","IPTV野外,http://faim.top:12306/rtp/239.77.0.101:5146"]
["239.253.43.73:5146","HD (V: h264; A: mp2@2ch)",null,null,"239.77.1.85:5146","239.77.1.85:5146","HD (V: h264; A: mp2@2ch)","IPTV野外,http://faim.top:12306/rtp/239.77.1.85:5146"]
["239.253.43.74:5146","HD (V: h264; A: mp2@2ch)",null,null,"239.77.0.102:5146","239.77.0.102:5146","HD (V: h264; A: mp2@2ch)","IPTV法治,http://faim.top:12306/rtp/239.77.0.102:5146"]
["239.253.43.75:5146","HD (V: h264; A: mp2@2ch)",null,null,"239.77.1.86:5146","239.77.1.86:5146","HD (V: h264; A: mp2@2ch)","IPTV法治,http://faim.top:12306/rtp/239.77.1.86:5146"]
["239.253.43.82:5146","HD (V: h264; A: mp2@2ch)",null,null,"239.77.0.110:5146","239.77.0.110:5146","HD (V: h264; A: mp2@2ch)","魅力时尚,http://faim.top:12306/rtp/239.77.0.110:5146"]
["239.253.43.83:5146","HD (V: h264; A: mp2@2ch)",null,null,"239.77.1.88:5146","239.77.1.88:5146","HD (V: h264; A: mp2@2ch)","IPTV魅力时尚,http://faim.top:12306/rtp/239.77.1.88:5146"]
["239.253.43.98:5146","HD (V: h264; A: mp2@2ch)",null,null,"239.77.0.104:5146","239.77.0.104:5146","HD (V: h264; A: mp2@2ch)","经典电影,http://faim.top:12306/rtp/239.77.0.104:5146"]
["239.253.43.99:5146","4K (V: hevc; A: aac@2ch)",null,null,"239.77.1.89:5146","239.77.1.89:5146","HD (V: h264; A: mp2@2ch)","IPTV经典电影,http://faim.top:12306/rtp/239.77.1.89:5146"]
["239.253.43.100:5146","HD (V: h264; A: mp2@2ch)",null,null,"239.77.0.106:5146","239.77.0.106:5146","HD (V: h264; A: mp2@2ch)","热播剧场,http://faim.top:12306/rtp/239.77.0.106:5146"]
["239.253.43.101:5146","HD (V: h264; A: mp2@2ch)",null,null,"239.77.1.90:5146","239.77.1.90:5146","HD (V: h264; A: mp2@2ch)","IPTV热播剧场,http://faim.top:12306/rtp/239.77.1.90:5146"]
["239.253.43.104:5146","HD (V: h264; A: mp2@2ch)",null,null,"239.77.0.109:5146","239.77.0.109:5146","HD (V: h264; A: mp2@2ch)","少儿动画,http://faim.top:12306/rtp/239.77.0.109:5146"]
["239.253.43.105:5146","HD (V: h264; A: mp2@2ch)",null,null,"239.77.1.91:5146","239.77.1.91:5146","HD (V: h264; A: mp2@2ch)","IPTV少儿动画,http://faim.top:12306/rtp/239.77.1.91:5146"]
["239.253.43.113:5146","HD (V: h264; A: mp2@2ch)",null,null,"239.77.0.111:5146","239.77.0.111:5146","HD (V: h264; A: mp2@2ch)","IPTV收视指南,http://faim.top:12306/rtp/239.77.0.111:5146"]
["239.253.43.114:5146","HD (V: h264; A: mp2@2ch)",null,null,"239.253.43.165:5146","239.253.43.165:5146","SD (V: h264; A: aac@2ch)","EBU,http://faim.top:12306/rtp/239.253.43.165:5146"]
["239.253.43.115:5146","SD (V: h264; A: mp2@2ch)",null,null,"239.77.1.183:5146","239.77.1.183:5146","SD (V: h264; A: mp2@2ch)","PPTV-1,http://faim.top:12306/rtp/239.77.1.183:5146"]
["239.253.43.116:5146","SD (V: h264; A: mp2@2ch)",null,null,"239.77.1.184:5146","239.77.1.184:5146","SD (V: h264; A: mp2@2ch)","PPTV-2,http://faim.top:12306/rtp/239.77.1.184:5146"]
["239.253.43.117:5146","SD (V: h264; A: mp2@2ch)",null,null,"239.77.0.240:5146","239.77.0.240:5146","SD (V: h264; A: mp2@2ch)","Unknown@239.77.0.240:5146,http://faim.top:12306/rtp/239.77.0.240:5146"]
["239.253.43.118:5146","SD (V: h264; A: mp2@2ch)",null,null,"239.77.1.13:5146","239.77.1.13:5146","4K (V: hevc; A: ac3@6ch)","Unknown@239.77.1.13:5146,http://faim.top:12306/rtp/239.77.1.13:5146"]
["239.253.43.119:5146","SD (V: h264; A: mp2@2ch)",null,null,"239.77.1.14:5146","239.77.1.14:5146","4K (V: hevc; A: ac3@6ch)","Unknown@239.77.1.14:5146,http://faim.top:12306/rtp/239.77.1.14:5146"]
["239.253.43.120:5146","HD (V: h264; A: mp2@2ch)",null,null,"239.77.1.234:5146","239.77.1.234:5146","HD (V: h264; A: mp2@2ch, mp2@2ch, mp2@2ch, mp2@2ch)","九屏同播,http://faim.top:12306/rtp/239.77.1.234:5146"]
["239.253.43.121:5146","HD (V: h264; A: mp2@2ch)",null,null,"239.77.1.107:5146","239.77.1.107:5146","HD (V: h264; A: ac3@6ch)","四屏同播,http://faim.top:12306/rtp/239.77.1.107:5146"]
["239.253.43.122:5146","HD (V: h264; A: mp2@2ch)",null,null,"239.77.0.232:5146","239.77.0.232:5146","SD (V: h264; A: mp2@2ch)","广东IPTV广告,http://faim.top:12306/rtp/239.77.0.232:5146"]
["239.253.43.123:5146","HD (V: h264; A: mp2@2ch)",null,null,"239.77.0.193:5146","239.77.0.193:5146","SD (V: h264; A: mp2@2ch)","广东IPTV广告,http://faim.top:12306/rtp/239.77.0.193:5146"]
["239.253.43.124:5146","HD (V: h264; A: mp2@2ch)",null,null,"239.77.0.190:5146","239.77.0.190:5146","SD (V: h264; A: mp2@2ch)","广东IPTV广告,http://faim.top:12306/rtp/239.77.0.190:5146"]
["239.253.43.125:5146","HD (V: h264; A: mp2@2ch)",null,null,"239.77.0.153:5146","239.77.0.153:5146","SD (V: h264; A: mp2@2ch)","广东IPTV广告,http://faim.top:12306/rtp/239.77.0.153:5146"]
["239.253.43.126:5146","SD (V: h264; A: mp2@1ch)",null,null,"239.77.0.233:5146","239.77.0.233:5146","SD (V: h264; A: mp2@2ch)","广东IPTV广告,http://faim.top:12306/rtp/239.77.0.233:5146"]
["239.253.43.127:5146","SD (V: h264; A: mp2@1ch)",null,null,"239.77.0.191:5146","239.77.0.191:5146","SD (V: h264; A: mp2@2ch)","广东IPTV广告,http://faim.top:12306/rtp/239.77.0.191:5146"]
["239.253.43.165:5146","SD (V: h264; A: aac@2ch)",null,null,"239.253.43.115:5146","239.253.43.115:5146","SD (V: h264; A: mp2@2ch)","百事通高清,http://faim.top:12306/rtp/239.253.43.115:5146"]
["239.253.43.196:5146","HD (V: h264; A: mp2@2ch)",null,null,"239.253.43.116:5146","239.253.43.116:5146","SD (V: h264; A: mp2@2ch)","百事通高清,http://faim.top:12306/rtp/239.253.43.116:5146"]
["239.253.43.200:5146","HD (V: h264; A: mp2@2ch)",null,null,"239.253.43.117:5146","239.253.43.117:5146","SD (V: h264; A: mp2@2ch)","百事通高清,http://faim.top:12306/rtp/239.253.43.117:5146"]
["239.253.43.201:5146","HD (V: h264; A: mp2@2ch)",null,null,"239.253.43.118:5146","239.253.43.118:5146","SD (V: h264; A: mp2@2ch)","百事通高清,http://faim.top:12306/rtp/239.253.43.118:5146"]
["239.253.43.213:5146","HD (V: h264; A: mp2@2ch)",null,null,"239.253.43.119:5146","239.253.43.119:5146","SD (V: h264; A: mp2@2ch)","百事通高清,http://faim.top:12306/rtp/239.253.43.119:5146"]
["239.253.43.214:5146","HD (V: h264; A: mp2@2ch)",null,null,"239.77.0.186:5146","239.77.0.186:5146","SD (V: h264; A: mp2@2ch)","精选频道1,http://faim.top:12306/rtp/239.77.0.186:5146"]

{"sheet":"Sheet2","index":2,"n_rows":933,"n_cols":2,"rows_kept":933,"cut":false,"hidden":false,"merged":[]}
["#EXTM3U name=\"广东电信IPTV\""]
["#EXTINF:-1 tvg-name=\"广东卫视\" group-title=\"IPTV-广东电视台\",广东卫视高清"]
["239.77.1.19:5146",{"$f":"VLOOKUP(A3,txt!A:A,1,0)","v":"239.77.1.19:5146"}]
["#EXTINF:-1 tvg-name=\"广东卫视\" group-title=\"IPTV-广东电视台\",广东卫视高清",{"$f":"VLOOKUP(A4,txt!A:A,1,0)","v":{"$error":"#N/A"}}]
["239.77.1.152:5146",{"$f":"VLOOKUP(A5,txt!A:A,1,0)","v":"239.77.1.152:5146"}]
["#EXTINF:-1 tvg-name=\"广东卫视\" group-title=\"IPTV-广东电视台\",广东卫视高清",{"$f":"VLOOKUP(A6,txt!A:A,1,0)","v":{"$error":"#N/A"}}]
["239.77.0.84:5146",{"$f":"VLOOKUP(A7,txt!A:A,1,0)","v":"239.77.0.84:5146"}]
["#EXTINF:-1 tvg-name=\"广东卫视\" group-title=\"IPTV-广东电视台\",广东卫视超清",{"$f":"VLOOKUP(A8,txt!A:A,1,0)","v":{"$error":"#N/A"}}]
["239.77.0.166:5146",{"$f":"VLOOKUP(A9,txt!A:A,1,0)","v":"239.77.0.166:5146"}]
["#EXTINF:-1 tvg-name=\"广东珠江\" group-title=\"IPTV-广东电视台\",广东珠江",{"$f":"VLOOKUP(A10,txt!A:A,1,0)","v":{"$error":"#N/A"}}]
["239.77.0.3:5146",{"$f":"VLOOKUP(A11,txt!A:A,1,0)","v":"239.77.0.3:5146"}]
["#EXTINF:-1 tvg-name=\"广东珠江\" group-title=\"IPTV-广东电视台\",广东珠江",{"$f":"VLOOKUP(A12,txt!A:A,1,0)","v":{"$error":"#N/A"}}]
["239.77.1.94:5146",{"$f":"VLOOKUP(A13,txt!A:A,1,0)","v":"239.77.1.94:5146"}]
["#EXTINF:-1 tvg-name=\"广东珠江\" group-title=\"IPTV-广东电视台\",广东珠江高清",{"$f":"VLOOKUP(A14,txt!A:A,1,0)","v":{"$error":"#N/A"}}]
["239.77.0.1:5146",{"$f":"VLOOKUP(A15,txt!A:A,1,0)","v":"239.77.0.1:5146"}]
["#EXTINF:-1 tvg-name=\"广东珠江\" group-title=\"IPTV-广东电视台\",广东珠江超清",{"$f":"VLOOKUP(A16,txt!A:A,1,0)","v":{"$error":"#N/A"}}]
["239.77.0.114:5146",{"$f":"VLOOKUP(A17,txt!A:A,1,0)","v":"239.77.0.114:5146"}]
["#EXTINF:-1 tvg-name=\"广东新闻\" group-title=\"IPTV-广东电视台\",广东新闻",{"$f":"VLOOKUP(A18,txt!A:A,1,0)","v":{"$error":"#N/A"}}]
["239.77.0.4:5146",{"$f":"VLOOKUP(A19,txt!A:A,1,0)","v":{"$error":"#N/A"}}]
["#EXTINF:-1 tvg-name=\"广东新闻\" group-title=\"IPTV-广东电视台\",广东新闻高清",{"$f":"VLOOKUP(A20,txt!A:A,1,0)","v":{"$error":"#N/A"}}]
["239.77.0.173:5146",{"$f":"VLOOKUP(A21,txt!A:A,1,0)","v":"239.77.0.173:5146"}]
["#EXTINF:-1 tvg-name=\"广东民生\" group-title=\"IPTV-广东电视台\",广东民生",{"$f":"VLOOKUP(A22,txt!A:A,1,0)","v":{"$error":"#N/A"}}]
["239.77.0.5:5146",{"$f":"VLOOKUP(A23,txt!A:A,1,0)","v":{"$error":"#N/A"}}]
["#EXTINF:-1 tvg-name=\"广东民生\" group-title=\"IPTV-广东电视台\",广东民生高清",{"$f":"VLOOKUP(A24,txt!A:A,1,0)","v":{"$error":"#N/A"}}]
["239.77.0.225:5146",{"$f":"VLOOKUP(A25,txt!A:A,1,0)","v":"239.77.0.225:5146"}]
["#EXTINF:-1 tvg-name=\"广东体育\" group-title=\"IPTV-广东电视台\",广东体育",{"$f":"VLOOKUP(A26,txt!A:A,1,0)","v":{"$error":"#N/A"}}]
["239.77.0.6:5146",{"$f":"VLOOKUP(A27,txt!A:A,1,0)","v":{"$error":"#N/A"}}]
["#EXTINF:-1 tvg-name=\"广东体育\" group-title=\"IPTV-广东电视台\",广东体育（深圳）",{"$f":"VLOOKUP(A28,txt!A:A,1,0)","v":{"$error":"#N/A"}}]
["239.77.1.97:5146",{"$f":"VLOOKUP(A29,txt!A:A,1,0)","v":"239.77.1.97:5146"}]
["#EXTINF:-1 tvg-name=\"广东体育\" group-title=\"IPTV-广东电视台\",广东体育高清-测试",{"$f":"VLOOKUP(A30,txt!A:A,1,0)","v":{"$error":"#N/A"}}]
["239.77.0.112:5146",{"$f":"VLOOKUP(A31,txt!A:A,1,0)","v":"239.77.0.112:5146"}]
["#EXTINF:-1 tvg-name=\"广东体育\" group-title=\"IPTV-广东电视台\",广东体育超清",{"$f":"VLOOKUP(A32,txt!A:A,1,0)","v":{"$error":"#N/A"}}]
["239.77.0.168:5146",{"$f":"VLOOKUP(A33,txt!A:A,1,0)","v":"239.77.0.168:5146"}]
["#EXTINF:-1 tvg-name=\"广东国际\" group-title=\"IPTV-广东电视台\",广东国际",{"$f":"VLOOKUP(A34,txt!A:A,1,0)","v":{"$error":"#N/A"}}]
["239.77.0.7:5146",{"$f":"VLOOKUP(A35,txt!A:A,1,0)","v":{"$error":"#N/A"}}]
["#EXTINF:-1 tvg-name=\"经济科教\" group-title=\"IPTV-广东电视台\",经济科教",{"$f":"VLOOKUP(A36,txt!A:A,1,0)","v":{"$error":"#N/A"}}]
["239.77.0.8:5146",{"$f":"VLOOKUP(A37,txt!A:A,1,0)","v":{"$error":"#N/A"}}]
["#EXTINF:-1 tvg-name=\"经济科教\" group-title=\"IPTV-广东电视台\",经济科教高清",{"$f":"VLOOKUP(A38,txt!A:A,1,0)","v":{"$error":"#N/A"}}]
["239.77.0.85:5146",{"$f":"VLOOKUP(A39,txt!A:A,1,0)","v":"239.77.0.85:5146"}]
["#EXTINF:-1 tvg-name=\"经济科教\" group-title=\"IPTV-广东电视台\",经济科教超清",{"$f":"VLOOKUP(A40,txt!A:A,1,0)","v":{"$error":"#N/A"}}]
["239.77.0.167:5146",{"$f":"VLOOKUP(A41,txt!A:A,1,0)","v":"239.77.0.167:5146"}]
["#EXTINF:-1 tvg-name=\"大湾区卫视\" group-title=\"IPTV-广东电视台\",大湾区卫视",{"$f":"VLOOKUP(A42,txt!A:A,1,0)","v":{"$error":"#N/A"}}]
["239.77.0.9:5146",{"$f":"VLOOKUP(A43,txt!A:A,1,0)","v":{"$error":"#N/A"}}]
["#EXTINF:-1 tvg-name=\"大湾区卫视\" group-title=\"IPTV-广东电视台\",大湾区卫视",{"$f":"VLOOKUP(A44,txt!A:A,1,0)","v":{"$error":"#N/A"}}]
["239.77.1.12:5146",{"$f":"VLOOKUP(A45,txt!A:A,1,0)","v":"239.77.1.12:5146"}]
["#EXTINF:-1 tvg-name=\"大湾区卫视\" group-title=\"IPTV-广东电视台\",大湾区卫视高清",{"$f":"VLOOKUP(A46,txt!A:A,1,0)","v":{"$error":"#N/A"}}]
["239.77.0.215:5146",{"$f":"VLOOKUP(A47,txt!A:A,1,0)","v":"239.77.0.215:5146"}]
["#EXTINF:-1 tvg-name=\"广东影视\" group-title=\"IPTV-广东电视台\",广东影视",{"$f":"VLOOKUP(A48,txt!A:A,1,0)","v":{"$error":"#N/A"}}]
["239.77.0.11:5146",{"$f":"VLOOKUP(A49,txt!A:A,1,0)","v":{"$error":"#N/A"}}]
["#EXTINF:-1 tvg-name=\"广东影视\" group-title=\"IPTV-广东电视台\",广东影视高清",{"$f":"VLOOKUP(A50,txt!A:A,1,0)","v":{"$error":"#N/A"}}]
["239.77.0.217:5146",{"$f":"VLOOKUP(A51,txt!A:A,1,0)","v":"239.77.0.217:5146"}]
["#EXTINF:-1 tvg-name=\"广东少儿\" group-title=\"IPTV-广东电视台\",广东少儿",{"$f":"VLOOKUP(A52,txt!A:A,1,0)","v":{"$error":"#N/A"}}]
["239.77.0.12:5146",{"$f":"VLOOKUP(A53,txt!A:A,1,0)","v":{"$error":"#N/A"}}]
["#EXTINF:-1 tvg-name=\"广东少儿\" group-title=\"IPTV-广东电视台\",广东少儿高清",{"$f":"VLOOKUP(A54,txt!A:A,1,0)","v":{"$error":"#N/A"}}]
["239.77.0.250:5146",{"$f":"VLOOKUP(A55,txt!A:A,1,0)","v":"239.77.0.250:5146"}]
["#EXTINF:-1 tvg-name=\"嘉佳卡通\" group-title=\"IPTV-广东电视台\",嘉佳卡通",{"$f":"VLOOKUP(A56,txt!A:A,1,0)","v":{"$error":"#N/A"}}]
["239.77.0.13:5146",{"$f":"VLOOKUP(A57,txt!A:A,1,0)","v":{"$error":"#N/A"}}]
["#EXTINF:-1 tvg-name=\"嘉佳卡通\" group-title=\"IPTV-广东电视台\",嘉佳卡通",{"$f":"VLOOKUP(A58,txt!A:A,1,0)","v":{"$error":"#N/A"}}]
["239.77.1.15:5146",{"$f":"VLOOKUP(A59,txt!A:A,1,0)","v":"239.77.1.15:5146"}]
["#EXTINF:-1 tvg-name=\"嘉佳卡通\" group-title=\"IPTV-广东电视台\",嘉佳卡通高清",{"$f":"VLOOKUP(A60,txt!A:A,1,0)","v":{"$error":"#N/A"}}]
["239.77.0.179:5146",{"$f":"VLOOKUP(A61,txt!A:A,1,0)","v":"239.77.0.179:5146"}]
["#EXTINF:-1 tvg-name=\"南方购物\" group-title=\"IPTV-广东电视台\",南方购物-精选",{"$f":"VLOOKUP(A62,txt!A:A,1,0)","v":{"$error":"#N/A"}}]
["239.77.0.19:5146",{"$f":"VLOOKUP(A63,txt!A:A,1,0)","v":"239.77.0.19:5146"}]
["#EXTINF:-1 tvg-name=\"南方购物\" group-title=\"IPTV-广东电视台\",南方购物",{"$f":"VLOOKUP(A64,txt!A:A,1,0)","v":{"$error":"#N/A"}}]
["239.77.0.22:5146",{"$f":"VLOOKUP(A65,txt!A:A,1,0)","v":"239.77.0.22:5146"}]
["#EXTINF:-1 tvg-name=\"南方购物\" group-title=\"IPTV-广东电视台\",南方购物高清",{"$f":"VLOOKUP(A66,txt!A:A,1,0)","v":{"$error":"#N/A"}}]
["239.77.0.241:5146",{"$f":"VLOOKUP(A67,txt!A:A,1,0)","v":"239.77.0.241:5146"}]
["#EXTINF:-1 tvg-name=\"岭南戏曲\" group-title=\"IPTV-广东电视台\",岭南戏曲",{"$f":"VLOOKUP(A68,txt!A:A,1,0)","v":{"$error":"#N/A"}}]
["239.77.0.16:5146",{"$f":"VLOOKUP(A69,txt!A:A,1,0)","v":{"$error":"#N/A"}}]
["#EXTINF:-1 tvg-name=\"岭南戏曲\" group-title=\"IPTV-广东电视台\",岭南戏曲高清",{"$f":"VLOOKUP(A70,txt!A:A,1,0)","v":{"$error":"#N/A"}}]
["239.77.0.122:5146",{"$f":"VLOOKUP(A71,txt!A:A,1,0)","v":"239.77.0.122:5146"}]
["#EXTINF:-1 tvg-name=\"现代教育\" group-title=\"IPTV-广东电视台\",现代教育",{"$f":"VLOOKUP(A72,txt!A:A,1,0)","v":{"$error":"#N/A"}}]
["239.77.0.18:5146",{"$f":"VLOOKUP(A73,txt!A:A,1,0)","v":{"$error":"#N/A"}}]
["#EXTINF:-1 tvg-name=\"现代教育\" group-title=\"IPTV-广东电视台\",现代教育高清",{"$f":"VLOOKUP(A74,txt!A:A,1,0)","v":{"$error":"#N/A"}}]
["239.77.0.213:5146",{"$f":"VLOOKUP(A75,txt!A:A,1,0)","v":"239.77.0.213:5146"}]
["#EXTINF:-1 tvg-name=\"广东移动\" group-title=\"IPTV-广东电视台\",广东移动",{"$f":"VLOOKUP(A76,txt!A:A,1,0)","v":{"$error":"#N/A"}}]
["239.77.0.20:5146",{"$f":"VLOOKUP(A77,txt!A:A,1,0)","v":"239.77.0.20:5146"}]
["#EXTINF:-1 tvg-name=\"广东综艺\" group-title=\"IPTV-广东电视台\",广东综艺 4K50p",{"$f":"VLOOKUP(A78,txt!A:A,1,0)","v":{"$error":"#N/A"}}]
["239.77.1.236:5146",{"$f":"VLOOKUP(A79,txt!A:A,1,0)","v":{"$error":"#N/A"}}]
["#EXTINF:-1 tvg-name=\"广东综艺\" group-title=\"IPTV-广东电视台\",广东综艺 4K",{"$f":"VLOOKUP(A80,txt!A:A,1,0)","v":{"$error":"#N/A"}}]
["239.77.1.237:5146",{"$f":"VLOOKUP(A81,txt!A:A,1,0)","v":"239.77.1.237:5146"}]
["#EXTINF:-1 tvg-name=\"广东综艺\" group-title=\"IPTV-广东电视台\",广东综艺(4k)",{"$f":"VLOOKUP(A82,txt!A:A,1,0)","v":{"$error":"#N/A"}}]
["239.77.0.244:5146",{"$f":"VLOOKUP(A83,txt!A:A,1,0)","v":"239.77.0.244:5146"}]
["#EXTINF:-1 tvg-name=\"广东综艺\" group-title=\"IPTV-广东电视台\",广东综艺 宽色域(4k)",{"$f":"VLOOKUP(A84,txt!A:A,1,0)","v":{"$error":"#N/A"}}]
["239.77.0.246:5146",{"$f":"VLOOKUP(A85,txt!A:A,1,0)","v":{"$error":"#N/A"}}]
["#EXTINF:-1 tvg-name=\"广东综艺\" group-title=\"IPTV-广东电视台\",广东综艺(4k)",{"$f":"VLOOKUP(A86,txt!A:A,1,0)","v":{"$error":"#N/A"}}]
["239.77.0.245:5146",{"$f":"VLOOKUP(A87,txt!A:A,1,0)","v":"239.77.0.245:5146"}]
["#EXTINF:-1 tvg-name=\"广东综艺\" group-title=\"IPTV-广东电视台\",广东综艺 宽色域AVS2(4k) (AVS2)",{"$f":"VLOOKUP(A88,txt!A:A,1,0)","v":{"$error":"#N/A"}}]
["239.77.0.252:5146",{"$f":"VLOOKUP(A89,txt!A:A,1,0)","v":"239.77.0.252:5146"}]
["#EXTINF:-1 tvg-name=\"广州综合\" group-title=\"IPTV-广州电视台\",广州综合高清",{"$f":"VLOOKUP(A90,txt!A:A,1,0)","v":{"$error":"#N/A"}}]
["239.253.43.71:5146",{"$f":"VLOOKUP(A91,txt!A:A,1,0)","v":"239.253.43.71:5146"}]
["#EXTINF:-1 tvg-name=\"广州新闻\" group-title=\"IPTV-广州电视台\",广州新闻高清",{"$f":"VLOOKUP(A92,txt!A:A,1,0)","v":{"$error":"#N/A"}}]
["239.253.43.72:5146",{"$f":"VLOOKUP(A93,txt!A:A,1,0)","v":"239.253.43.72:5146"}]
["#EXTINF:-1 tvg-name=\"广州影视\" group-title=\"IPTV-广州电视台\",广州影视高清",{"$f":"VLOOKUP(A94,txt!A:A,1,0)","v":{"$error":"#N/A"}}]
["239.253.43.73:5146",{"$f":"VLOOKUP(A95,txt!A:A,1,0)","v":"239.253.43.73:5146"}]
["#EXTINF:-1 tvg-name=\"广州法治\" group-title=\"IPTV-广州电视台\",广州法治高清",{"$f":"VLOOKUP(A96,txt!A:A,1,0)","v":{"$error":"#N/A"}}]
["239.253.43.74:5146",{"$f":"VLOOKUP(A97,txt!A:A,1,0)","v":"239.253.43.74:5146"}]
["#EXTINF:-1 tvg-name=\"南国都市\" group-title=\"IPTV-广州电视台\",南国都市 4K",{"$f":"VLOOKUP(A98,txt!A:A,1,0)","v":{"$error":"#N/A"}}]
["239.253.43.99:5146",{"$f":"VLOOKUP(A99,txt!A:A,1,0)","v":"239.253.43.99:5146"}]
["#EXTINF:-1 tvg-name=\"深圳卫视\" group-title=\"IPTV-深圳电视台\",深圳卫视",{"$f":"VLOOKUP(A100,txt!A:A,1,0)","v":{"$error":"#N/A"}}]
["239.77.0.55:5146",{"$f":"VLOOKUP(A101,txt!A:A,1,0)","v":{"$error":"#N/A"}}]
["#EXTINF:-1 tvg-name=\"深圳卫视\" group-title=\"IPTV-深圳电视台\",深圳卫视高清",{"$f":"VLOOKUP(A102,txt!A:A,1,0)","v":{"$error":"#N/A"}}]
["239.77.1.3:5146",{"$f":"VLOOKUP(A103,txt!A:A,1,0)","v":"239.77.1.3:5146"}]
["#EXTINF:-1 tvg-name=\"深圳卫视\" group-title=\"IPTV-深圳电视台\",深圳卫视高清",{"$f":"VLOOKUP(A104,txt!A:A,1,0)","v":{"$error":"#N/A"}}]
["239.77.1.148:5146",{"$f":"VLOOKUP(A105,txt!A:A,1,0)","v":"239.77.1.148:5146"}]
["#EXTINF:-1 tvg-name=\"深圳卫视\" group-title=\"IPTV-深圳电视台\",深圳卫视高清",{"$f":"VLOOKUP(A106,txt!A:A,1,0)","v":{"$error":"#N/A"}}]
["239.77.0.92:5146",{"$f":"VLOOKUP(A107,txt!A:A,1,0)","v":"239.77.0.92:5146"}]
["#EXTINF:-1 tvg-name=\"深圳卫视\" group-title=\"IPTV-深圳电视台\",深圳卫视超清",{"$f":"VLOOKUP(A108,txt!A:A,1,0)","v":{"$error":"#N/A"}}]
["239.77.0.130:5146",{"$f":"VLOOKUP(A109,txt!A:A,1,0)","v":"239.77.0.130:5146"}]
["#EXTINF:-1 tvg-name=\"深圳都市频道\" group-title=\"IPTV-深圳电视台\",深圳都市频道高清",{"$f":"VLOOKUP(A110,txt!A:A,1,0)","v":{"$error":"#N/A"}}]
["239.77.1.176:5146",{"$f":"VLOOKUP(A111,txt!A:A,1,0)","v":"239.77.1.176:5146"}]
["#EXTINF:-1 tvg-name=\"深圳都市频道\" group-title=\"IPTV-深圳电视台\",深圳都市频道高清",{"$f":"VLOOKUP(A112,txt!A:A,1,0)","v":{"$error":"#N/A"}}]
["239.77.1.124:5146",{"$f":"VLOOKUP(A113,txt!A:A,1,0)","v":"239.77.1.124:5146"}]
["#EXTINF:-1 tvg-name=\"深圳电视剧频道\" group-title=\"IPTV-深圳电视台\",深圳电视剧频道高清",{"$f":"VLOOKUP(A114,txt!A:A,1,0)","v":{"$error":"#N/A"}}]
["239.77.1.177:5146",{"$f":"VLOOKUP(A115,txt!A:A,1,0)","v":"239.77.1.177:5146"}]
["#EXTINF:-1 tvg-name=\"深圳电视剧频道\" group-title=\"IPTV-深圳电视台\",深圳电视剧频道高清",{"$f":"VLOOKUP(A116,txt!A:A,1,0)","v":{"$error":"#N/A"}}]
["239.77.1.125:5146",{"$f":"VLOOKUP(A117,txt!A:A,1,0)","v":"239.77.1.125:5146"}]
["#EXTINF:-1 tvg-name=\"深圳财经生活\" group-title=\"IPTV-深圳电视台\",深圳财经生活高清",{"$f":"VLOOKUP(A118,txt!A:A,1,0)","v":{"$error":"#N/A"}}]
["239.77.1.242:5146",{"$f":"VLOOKUP(A119,txt!A:A,1,0)","v":"239.77.1.242:5146"}]
["#EXTINF:-1 tvg-name=\"深圳体育健康\" group-title=\"IPTV-深圳电视台\",深圳体育健康高清",{"$f":"VLOOKUP(A120,txt!A:A,1,0)","v":{"$error":"#N/A"}}]
["239.77.1.128:5146",{"$f":"VLOOKUP(A121,txt!A:A,1,0)","v":"239.77.1.128:5146"}]
["#EXTINF:-1 tvg-name=\"深圳体育健康\" group-title=\"IPTV-深圳电视台\",深圳体育健康高清",{"$f":"VLOOKUP(A122,txt!A:A,1,0)","v":{"$error":"#N/A"}}]
["239.77.1.140:5146",{"$f":"VLOOKUP(A123,txt!A:A,1,0)","v":"239.77.1.140:5146"}]
["#EXTINF:-1 tvg-name=\"深圳少儿频道\" group-title=\"IPTV-深圳电视台\",深圳少儿频道高清",{"$f":"VLOOKUP(A124,txt!A:A,1,0)","v":{"$error":"#N/A"}}]
["239.77.1.244:5146",{"$f":"VLOOKUP(A125,txt!A:A,1,0)","v":"239.77.1.244:5146"}]
["#EXTINF:-1 tvg-name=\"深圳宝安频道\" group-title=\"IPTV-深圳电视台\",深圳宝安频道高清",{"$f":"VLOOKUP(A126,txt!A:A,1,0)","v":{"$error":"#N/A"}}]
["239.77.1.67:5146",{"$f":"VLOOKUP(A127,txt!A:A,1,0)","v":"239.77.1.67:5146"}]
["#EXTINF:-1 tvg-name=\"深圳宝安第一课\" group-title=\"IPTV-深圳电视台\",深圳宝安第一课",{"$f":"VLOOKUP(A128,txt!A:A,1,0)","v":{"$error":"#N/A"}}]
["239.77.1.225:5146",{"$f":"VLOOKUP(A129,txt!A:A,1,0)","v":"239.77.1.225:5146"}]
["#EXTINF:-1 tvg-name=\"深圳龙岗频道\" group-title=\"IPTV-深圳电视台\",深圳龙岗频道高清",{"$f":"VLOOKUP(A130,txt!A:A,1,0)","v":{"$error":"#N/A"}}]
["239.77.1.223:5146",{"$f":"VLOOKUP(A131,txt!A:A,1,0)","v":"239.77.1.223:5146"}]
["#EXTINF:-1 tvg-name=\"深圳众创TV\" group-title=\"IPTV-深圳电视台\",深圳众创TV高清",{"$f":"VLOOKUP(A132,txt!A:A,1,0)","v":{"$error":"#N/A"}}]
["239.77.1.247:5146",{"$f":"VLOOKUP(A133,txt!A:A,1,0)","v":{"$error":"#N/A"}}]
["#EXTINF:-1 tvg-name=\"深圳移动电视\" group-title=\"IPTV-深圳电视台\",深圳移动电视",{"$f":"VLOOKUP(A134,txt!A:A,1,0)","v":{"$error":"#N/A"}}]
["239.77.1.175:5146",{"$f":"VLOOKUP(A135,txt!A:A,1,0)","v":"239.77.1.175:5146"}]
["#EXTINF:-1 tvg-name=\"深圳宜和购物\" group-title=\"IPTV-深圳电视台\",深圳宜和购物高清",{"$f":"VLOOKUP(A136,txt!A:A,1,0)","v":{"$error":"#N/A"}}]
["239.77.1.87:5146",{"$f":"VLOOKUP(A137,txt!A:A,1,0)","v":"239.77.1.87:5146"}]
["#EXTINF:-1 tvg-name=\"韶关新闻综合\" group-title=\"IPTV-广东地方台\",韶关新闻综合高清",{"$f":"VLOOKUP(A138,txt!A:A,1,0)","v":{"$error":"#N/A"}}]
["239.77.0.117:5146",{"$f":"VLOOKUP(A139,txt!A:A,1,0)","v":"239.77.0.117:5146"}]
["#EXTINF:-1 tvg-name=\"湛江新闻综合\" group-title=\"IPTV-广东地方台\",湛江新闻综合高清",{"$f":"VLOOKUP(A140,txt!A:A,1,0)","v":{"$error":"#N/A"}}]
["239.77.0.141:5146",{"$f":"VLOOKUP(A141,txt!A:A,1,0)","v":"239.77.0.141:5146"}]
["#EXTINF:-1 tvg-name=\"湛江公共\" group-title=\"IPTV-广东地方台\",湛江公共高清",{"$f":"VLOOKUP(A142,txt!A:A,1,0)","v":{"$error":"#N/A"}}]
["239.77.0.140:5146",{"$f":"VLOOKUP(A143,txt!A:A,1,0)","v":"239.77.0.140:5146"}]
["#EXTINF:-1 tvg-name=\"揭阳综合\" group-title=\"IPTV-广东地方台\",揭阳综合高清",{"$f":"VLOOKUP(A144,txt!A:A,1,0)","v":{"$error":"#N/A"}}]
["239.77.0.229:5146",{"$f":"VLOOKUP(A145,txt!A:A,1,0)","v":"239.77.0.229:5146"}]
["#EXTINF:-1 tvg-name=\"揭阳生活\" group-title=\"IPTV-广东地方台\",揭阳生活高清",{"$f":"VLOOKUP(A146,txt!A:A,1,0)","v":{"$error":"#N/A"}}]
["239.77.0.251:5146",{"$f":"VLOOKUP(A147,txt!A:A,1,0)","v":"239.77.0.251:5146"}]
["#EXTINF:-1 tvg-name=\"汕尾新闻综合\" group-title=\"IPTV-广东地方台\",汕尾新闻综合高清",{"$f":"VLOOKUP(A148,txt!A:A,1,0)","v":{"$error":"#N/A"}}]
["239.77.0.25:5146",{"$f":"VLOOKUP(A149,txt!A:A,1,0)","v":"239.77.0.25:5146"}]
["#EXTINF:-1 tvg-name=\"汕尾文化生活\" group-title=\"IPTV-广东地方台\",汕尾文化生活高清",{"$f":"VLOOKUP(A150,txt!A:A,1,0)","v":{"$error":"#N/A"}}]
["239.77.0.187:5146",{"$f":"VLOOKUP(A151,txt!A:A,1,0)","v":"239.77.0.187:5146"}]
["#EXTINF:-1 tvg-name=\"江门综合\" group-title=\"IPTV-广东地方台\",江门综合高清",{"$f":"VLOOKUP(A152,txt!A:A,1,0)","v":{"$error":"#N/A"}}]
["239.77.0.201:5146",{"$f":"VLOOKUP(A153,txt!A:A,1,0)","v":"239.77.0.201:5146"}]
["#EXTINF:-1 tvg-name=\"江门侨乡生活\" group-title=\"IPTV-广东地方台\",江门侨乡生活高清",{"$f":"VLOOKUP(A154,txt!A:A,1,0)","v":{"$error":"#N/A"}}]
["239.77.0.202:5146",{"$f":"VLOOKUP(A155,txt!A:A,1,0)","v":"239.77.0.202:5146"}]
["#EXTINF:-1 tvg-name=\"HZTV-1\" group-title=\"IPTV-广东地方台\",HZTV-1高清",{"$f":"VLOOKUP(A156,txt!A:A,1,0)","v":{"$error":"#N/A"}}]
["239.77.1.232:5146",{"$f":"VLOOKUP(A157,txt!A:A,1,0)","v":"239.77.1.232:5146"}]
["#EXTINF:-1 tvg-name=\"HZTV-2\" group-title=\"IPTV-广东地方台\",HZTV-2高清",{"$f":"VLOOKUP(A158,txt!A:A,1,0)","v":{"$error":"#N/A"}}]
["239.77.1.233:5146",{"$f":"VLOOKUP(A159,txt!A:A,1,0)","v":"239.77.1.233:5146"}]
["#EXTINF:-1 tvg-name=\"珠海-1\" group-title=\"IPTV-广东地方台\",珠海-1高清",{"$f":"VLOOKUP(A160,txt!A:A,1,0)","v":{"$error":"#N/A"}}]
["239.77.0.155:5146",{"$f":"VLOOKUP(A161,txt!A:A,1,0)","v":"239.77.0.155:5146"}]
["#EXTINF:-1 tvg-name=\"珠海-2\" group-title=\"IPTV-广东地方台\",珠海-2高清",{"$f":"VLOOKUP(A162,txt!A:A,1,0)","v":{"$error":"#N/A"}}]
["239.77.0.154:5146",{"$f":"VLOOKUP(A163,txt!A:A,1,0)","v":{"$error":"#N/A"}}]
["#EXTINF:-1 tvg-name=\"肇庆综合\" group-title=\"IPTV-广东地方台\",肇庆综合高清",{"$f":"VLOOKUP(A164,txt!A:A,1,0)","v":{"$error":"#N/A"}}]
["239.253.43.1:5146",{"$f":"VLOOKUP(A165,txt!A:A,1,0)","v":"239.253.43.1:5146"}]
["#EXTINF:-1 tvg-name=\"肇庆生活服务\" group-title=\"IPTV-广东地方台\",肇庆生活服务高清",{"$f":"VLOOKUP(A166,txt!A:A,1,0)","v":{"$error":"#N/A"}}]
["239.253.43.2:5146",{"$f":"VLOOKUP(A167,txt!A:A,1,0)","v":"239.253.43.2:5146"}]
["#EXTINF:-1 tvg-name=\"河源综合\" group-title=\"IPTV-广东地方台\",河源综合",{"$f":"VLOOKUP(A168,txt!A:A,1,0)","v":{"$error":"#N/A"}}]
["239.253.43.215:5146",{"$f":"VLOOKUP(A169,txt!A:A,1,0)","v":{"$error":"#N/A"}}]
["#EXTINF:-1 tvg-name=\"河源综合\" group-title=\"IPTV-广东地方台\",河源综合高清",{"$f":"VLOOKUP(A170,txt!A:A,1,0)","v":{"$error":"#N/A"}}]
["239.253.43.213:5146",{"$f":"VLOOKUP(A171,txt!A:A,1,0)","v":"239.253.43.213:5146"}]
["#EXTINF:-1 tvg-name=\"河源公共\" group-title=\"IPTV-广东地方台\",河源公共高清",{"$f":"VLOOKUP(A172,txt!A:A,1,0)","v":{"$error":"#N/A"}}]
["239.253.43.214:5146",{"$f":"VLOOKUP(A173,txt!A:A,1,0)","v":"239.253.43.214:5146"}]
["#EXTINF:-1 tvg-name=\"清远新闻综合\" group-title=\"IPTV-广东地方台\",清远新闻综合高清",{"$f":"VLOOKUP(A174,txt!A:A,1,0)","v":{"$error":"#N/A"}}]
["239.253.43.33:5146",{"$f":"VLOOKUP(A175,txt!A:A,1,0)","v":"239.253.43.33:5146"}]
["#EXTINF:-1 tvg-name=\"清远文旅生活\" group-title=\"IPTV-广东地方台\",清远文旅生活高清",{"$f":"VLOOKUP(A176,txt!A:A,1,0)","v":{"$error":"#N/A"}}]
["239.253.43.34:5146",{"$f":"VLOOKUP(A177,txt!A:A,1,0)","v":"239.253.43.34:5146"}]
["#EXTINF:-1 tvg-name=\"云浮综合\" group-title=\"IPTV-广东地方台\",云浮综合高清",{"$f":"VLOOKUP(A178,txt!A:A,1,0)","v":{"$error":"#N/A"}}]
["239.77.0.253:5146",{"$f":"VLOOKUP(A179,txt!A:A,1,0)","v":"239.77.0.253:5146"}]
["#EXTINF:-1 tvg-name=\"云浮文旅\" group-title=\"IPTV-广东地方台\",云浮文旅高清",{"$f":"VLOOKUP(A180,txt!A:A,1,0)","v":{"$error":"#N/A"}}]
["239.77.0.254:5146",{"$f":"VLOOKUP(A181,txt!A:A,1,0)","v":"239.77.0.254:5146"}]
["#EXTINF:-1 tvg-name=\"茂名综合\" group-title=\"IPTV-广东地方台\",茂名综合高清",{"$f":"VLOOKUP(A182,txt!A:A,1,0)","v":{"$error":"#N/A"}}]
["239.77.0.206:5146",{"$f":"VLOOKUP(A183,txt!A:A,1,0)","v":"239.77.0.206:5146"}]
["#EXTINF:-1 tvg-name=\"茂名公共\" group-title=\"IPTV-广东地方台\",茂名公共高清",{"$f":"VLOOKUP(A184,txt!A:A,1,0)","v":{"$error":"#N/A"}}]
["239.77.0.207:5146",{"$f":"VLOOKUP(A185,txt!A:A,1,0)","v":"239.77.0.207:5146"}]
["#EXTINF:-1 tvg-name=\"汕头综合\" group-title=\"IPTV-广东地方台\",汕头综合高清",{"$f":"VLOOKUP(A186,txt!A:A,1,0)","v":{"$error":"#N/A"}}]
["239.77.1.130:5146",{"$f":"VLOOKUP(A187,txt!A:A,1,0)","v":"239.77.1.130:5146"}]
["#EXTINF:-1 tvg-name=\"汕头综合\" group-title=\"IPTV-广东地方台\",汕头综合高清",{"$f":"VLOOKUP(A188,txt!A:A,1,0)","v":{"$error":"#N/A"}}]
["239.253.43.45:5146",{"$f":"VLOOKUP(A189,txt!A:A,1,0)","v":"239.253.43.45:5146"}]
["#EXTINF:-1 tvg-name=\"汕头经济生活\" group-title=\"IPTV-广东地方台\",汕头经济生活高清",{"$f":"VLOOKUP(A190,txt!A:A,1,0)","v":{"$error":"#N/A"}}]
["239.77.1.131:5146",{"$f":"VLOOKUP(A191,txt!A:A,1,0)","v":"239.77.1.131:5146"}]
["#EXTINF:-1 tvg-name=\"汕头经济生活\" group-title=\"IPTV-广东地方台\",汕头经济生活高清",{"$f":"VLOOKUP(A192,txt!A:A,1,0)","v":{"$error":"#N/A"}}]
["239.253.43.46:5146",{"$f":"VLOOKUP(A193,txt!A:A,1,0)","v":"239.253.43.46:5146"}]
["#EXTINF:-1 tvg-name=\"汕头文旅体育\" group-title=\"IPTV-广东地方台\",汕头文旅体育高清",{"$f":"VLOOKUP(A194,txt!A:A,1,0)","v":{"$error":"#N/A"}}]
["239.77.1.132:5146",{"$f":"VLOOKUP(A195,txt!A:A,1,0)","v":"239.77.1.132:5146"}]
["#EXTINF:-1 tvg-name=\"汕头文旅体育\" group-title=\"IPTV-广东地方台\",汕头文旅体育高清",{"$f":"VLOOKUP(A196,txt!A:A,1,0)","v":{"$error":"#N/A"}}]
["239.253.43.47:5146",{"$f":"VLOOKUP(A197,txt!A:A,1,0)","v":{"$error":"#N/A"}}]
["#EXTINF:-1 tvg-name=\"佛山公共\" group-title=\"IPTV-广东地方台\",佛山公共高清",{"$f":"VLOOKUP(A198,txt!A:A,1,0)","v":{"$error":"#N/A"}}]
["239.253.43.53:5146",{"$f":"VLOOKUP(A199,txt!A:A,1,0)","v":"239.253.43.53:5146"}]
["#EXTINF:-1 tvg-name=\"佛山南海\" group-title=\"IPTV-广东地方台\",佛山南海",{"$f":"VLOOKUP(A200,txt!A:A,1,0)","v":{"$error":"#N/A"}}]
["239.77.0.236:5146",{"$f":"VLOOKUP(A201,txt!A:A,1,0)","v":"239.77.0.236:5146"}]
["#EXTINF:-1 tvg-name=\"佛山南海\" group-title=\"IPTV-广东地方台\",佛山南海高清",{"$f":"VLOOKUP(A202,txt!A:A,1,0)","v":{"$error":"#N/A"}}]
["239.253.43.54:5146",{"$f":"VLOOKUP(A203,txt!A:A,1,0)","v":"239.253.43.54:5146"}]
["#EXTINF:-1 tvg-name=\"佛山顺德\" group-title=\"IPTV-广东地方台\",佛山顺德高清",{"$f":"VLOOKUP(A204,txt!A:A,1,0)","v":{"$error":"#N/A"}}]
["239.253.43.55:5146",{"$f":"VLOOKUP(A205,txt!A:A,1,0)","v":"239.253.43.55:5146"}]
["#EXTINF:-1 tvg-name=\"佛山影视\" group-title=\"IPTV-广东地方台\",佛山影视高清",{"$f":"VLOOKUP(A206,txt!A:A,1,0)","v":{"$error":"#N/A"}}]
["239.253.43.56:5146",{"$f":"VLOOKUP(A207,txt!A:A,1,0)","v":"239.253.43.56:5146"}]
["#EXTINF:-1 tvg-name=\"佛山综合\" group-title=\"IPTV-广东地方台\",佛山综合高清",{"$f":"VLOOKUP(A208,txt!A:A,1,0)","v":{"$error":"#N/A"}}]
["239.253.43.57:5146",{"$f":"VLOOKUP(A209,txt!A:A,1,0)","v":"239.253.43.57:5146"}]
["#EXTINF:-1 tvg-name=\"东莞新闻综合\" group-title=\"IPTV-广东地方台\",东莞新闻综合高清",{"$f":"VLOOKUP(A210,txt!A:A,1,0)","v":{"$error":"#N/A"}}]
["239.253.43.104:5146",{"$f":"VLOOKUP(A211,txt!A:A,1,0)","v":"239.253.43.104:5146"}]
["#EXTINF:-1 tvg-name=\"东莞生活资讯\" group-title=\"IPTV-广东地方台\",东莞生活资讯高清",{"$f":"VLOOKUP(A212,txt!A:A,1,0)","v":{"$error":"#N/A"}}]
["239.253.43.105:5146",{"$f":"VLOOKUP(A213,txt!A:A,1,0)","v":"239.253.43.105:5146"}]
["#EXTINF:-1 tvg-name=\"中山综合\" group-title=\"IPTV-广东地方台\",中山综合高清",{"$f":"VLOOKUP(A214,txt!A:A,1,0)","v":{"$error":"#N/A"}}]
["239.77.0.185:5146",{"$f":"VLOOKUP(A215,txt!A:A,1,0)","v":"239.77.0.185:5146"}]
["#EXTINF:-1 tvg-name=\"中山综合\" group-title=\"IPTV-广东地方台\",中山综合高清",{"$f":"VLOOKUP(A216,txt!A:A,1,0)","v":{"$error":"#N/A"}}]
["239.253.43.62:5146",{"$f":"VLOOKUP(A217,txt!A:A,1,0)","v":"239.253.43.62:5146"}]
["#EXTINF:-1 tvg-name=\"香山文化\" group-title=\"IPTV-广东地方台\",香山文化高清",{"$f":"VLOOKUP(A218,txt!A:A,1,0)","v":{"$error":"#N/A"}}]
["239.253.43.63:5146",{"$f":"VLOOKUP(A219,txt!A:A,1,0)","v":"239.253.43.63:5146"}]
["#EXTINF:-1 tvg-name=\"潮州综合\" group-title=\"IPTV-广东地方台\",潮州综合高清",{"$f":"VLOOKUP(A220,txt!A:A,1,0)","v":{"$error":"#N/A"}}]
["239.253.43.70:5146",{"$f":"VLOOKUP(A221,txt!A:A,1,0)","v":"239.253.43.70:5146"}]
["#EXTINF:-1 tvg-name=\"潮州民生\" group-title=\"IPTV-广东地方台\",潮州民生高清",{"$f":"VLOOKUP(A222,txt!A:A,1,0)","v":{"$error":"#N/A"}}]
["239.253.43.75:5146",{"$f":"VLOOKUP(A223,txt!A:A,1,0)","v":"239.253.43.75:5146"}]
["#EXTINF:-1 tvg-name=\"梅州综合\" group-title=\"IPTV-广东地方台\",梅州综合高清",{"$f":"VLOOKUP(A224,txt!A:A,1,0)","v":{"$error":"#N/A"}}]
["239.253.43.123:5146",{"$f":"VLOOKUP(A225,txt!A:A,1,0)","v":"239.253.43.123:5146"}]
["#EXTINF:-1 tvg-name=\"客家生活\" group-title=\"IPTV-广东地方台\",客家生活高清",{"$f":"VLOOKUP(A226,txt!A:A,1,0)","v":{"$error":"#N/A"}}]
["239.253.43.124:5146",{"$f":"VLOOKUP(A227,txt!A:A,1,0)","v":"239.253.43.124:5146"}]
["#EXTINF:-1 tvg-name=\"阳江-1\" group-title=\"IPTV-广东地方台\",阳江-1高清",{"$f":"VLOOKUP(A228,txt!A:A,1,0)","v":{"$error":"#N/A"}}]
["239.253.43.82:5146",{"$f":"VLOOKUP(A229,txt!A:A,1,0)","v":"239.253.43.82:5146"}]
["#EXTINF:-1 tvg-name=\"阳江-2\" group-title=\"IPTV-广东地方台\",阳江-2高清",{"$f":"VLOOKUP(A230,txt!A:A,1,0)","v":{"$error":"#N/A"}}]
["239.253.43.83:5146",{"$f":"VLOOKUP(A231,txt!A:A,1,0)","v":"239.253.43.83:5146"}]
["#EXTINF:-1 tvg-name=\"CCTV-1\" group-title=\"IPTV-央视\",CCTV-1",{"$f":"VLOOKUP(A232,txt!A:A,1,0)","v":{"$error":"#N/A"}}]
["239.77.0.14:5146",{"$f":"VLOOKUP(A233,txt!A:A,1,0)","v":"239.77.0.14:5146"}]
["#EXTINF:-1 tvg-name=\"CCTV-1\" group-title=\"IPTV-央视\",CCTV-1综合",{"$f":"VLOOKUP(A234,txt!A:A,1,0)","v":{"$error":"#N/A"}}]
["239.77.0.30:5146",{"$f":"VLOOKUP(A235,txt!A:A,1,0)","v":"239.77.0.30:5146"}]
["#EXTINF:-1 tvg-name=\"CCTV-1\" group-title=\"IPTV-央视\",CCTV-1高清",{"$f":"VLOOKUP(A236,txt!A:A,1,0)","v":{"$error":"#N/A"}}]
["239.77.1.17:5146",{"$f":"VLOOKUP(A237,txt!A:A,1,0)","v":"239.77.1.17:5146"}]
["#EXTINF:-1 tvg-name=\"CCTV-1\" group-title=\"IPTV-央视\",CCTV-1高清",{"$f":"VLOOKUP(A238,txt!A:A,1,0)","v":{"$error":"#N/A"}}]
["239.77.1.144:5146",{"$f":"VLOOKUP(A239,txt!A:A,1,0)","v":"239.77.1.144:5146"}]
["#EXTINF:-1 tvg-name=\"CCTV-1\" group-title=\"IPTV-央视\",CCTV-1高清",{"$f":"VLOOKUP(A240,txt!A:A,1,0)","v":{"$error":"#N/A"}}]
["239.77.1.76:5146",{"$f":"VLOOKUP(A241,txt!A:A,1,0)","v":"239.77.1.76:5146"}]
["#EXTINF:-1 tvg-name=\"CCTV-1\" group-title=\"IPTV-央视\",CCTV-1高清",{"$f":"VLOOKUP(A242,txt!A:A,1,0)","v":{"$error":"#N/A"}}]
["239.77.0.119:5146",{"$f":"VLOOKUP(A243,txt!A:A,1,0)","v":"239.77.0.119:5146"}]
["#EXTINF:-1 tvg-name=\"CCTV-1\" group-title=\"IPTV-央视\",CCTV-1高清(CCTV -1综合高清)",{"$f":"VLOOKUP(A244,txt!A:A,1,0)","v":{"$error":"#N/A"}}]
["239.77.0.86:5146",{"$f":"VLOOKUP(A245,txt!A:A,1,0)","v":"239.77.0.86:5146"}]
["#EXTINF:-1 tvg-name=\"CCTV-1\" group-title=\"IPTV-央视\",CCTV-1超清",{"$f":"VLOOKUP(A246,txt!A:A,1,0)","v":{"$error":"#N/A"}}]
["239.77.0.129:5146",{"$f":"VLOOKUP(A247,txt!A:A,1,0)","v":"239.77.0.129:5146"}]
["#EXTINF:-1 tvg-name=\"CCTV-2\" group-title=\"IPTV-央视\",CCTV-2财经",{"$f":"VLOOKUP(A248,txt!A:A,1,0)","v":{"$error":"#N/A"}}]
["239.77.0.31:5146",{"$f":"VLOOKUP(A249,txt!A:A,1,0)","v":"239.77.0.31:5146"}]
["#EXTINF:-1 tvg-name=\"CCTV-2\" group-title=\"IPTV-央视\",CCTV-2高清",{"$f":"VLOOKUP(A250,txt!A:A,1,0)","v":{"$error":"#N/A"}}]
["239.77.1.158:5146",{"$f":"VLOOKUP(A251,txt!A:A,1,0)","v":"239.77.1.158:5146"}]
["#EXTINF:-1 tvg-name=\"CCTV-2\" group-title=\"IPTV-央视\",CCTV-2高清 (CAVS)",{"$f":"VLOOKUP(A252,txt!A:A,1,0)","v":{"$error":"#N/A"}}]
["239.253.43.17:5146",{"$f":"VLOOKUP(A253,txt!A:A,1,0)","v":"239.253.43.17:5146"}]
["#EXTINF:-1 tvg-name=\"CCTV-2\" group-title=\"IPTV-央视\",CCTV-2高清测试(CCTV -2财经高清)",{"$f":"VLOOKUP(A254,txt!A:A,1,0)","v":{"$error":"#N/A"}}]
["239.77.0.137:5146",{"$f":"VLOOKUP(A255,txt!A:A,1,0)","v":"239.77.0.137:5146"}]
["#EXTINF:-1 tvg-name=\"CCTV-3\" group-title=\"IPTV-央视\",CCTV-3综艺",{"$f":"VLOOKUP(A256,txt!A:A,1,0)","v":{"$error":"#N/A"}}]
["239.77.0.32:5146",{"$f":"VLOOKUP(A257,txt!A:A,1,0)","v":"239.77.0.32:5146"}]
["#EXTINF:-1 tvg-name=\"CCTV-3\" group-title=\"IPTV-央视\",CCTV-3高清",{"$f":"VLOOKUP(A258,txt!A:A,1,0)","v":{"$error":"#N/A"}}]
["239.77.0.169:5146",{"$f":"VLOOKUP(A259,txt!A:A,1,0)","v":"239.77.0.169:5146"}]
["#EXTINF:-1 tvg-name=\"CCTV-3\" group-title=\"IPTV-央视\",CCTV-3超清 (CAVS)",{"$f":"VLOOKUP(A260,txt!A:A,1,0)","v":{"$error":"#N/A"}}]
["239.77.0.175:5146",{"$f":"VLOOKUP(A261,txt!A:A,1,0)","v":"239.77.0.175:5146"}]
["#EXTINF:-1 tvg-name=\"CCTV-4\" group-title=\"IPTV-央视\",CCTV-4中文国际",{"$f":"VLOOKUP(A262,txt!A:A,1,0)","v":{"$error":"#N/A"}}]
["239.77.0.33:5146",{"$f":"VLOOKUP(A263,txt!A:A,1,0)","v":"239.77.0.33:5146"}]
["#EXTINF:-1 tvg-name=\"CCTV-4\" group-title=\"IPTV-央视\",CCTV-4高清",{"$f":"VLOOKUP(A264,txt!A:A,1,0)","v":{"$error":"#N/A"}}]
["239.77.1.163:5146",{"$f":"VLOOKUP(A265,txt!A:A,1,0)","v":"239.77.1.163:5146"}]
["#EXTINF:-1 tvg-name=\"CCTV-4\" group-title=\"IPTV-央视\",CCTV-4高清",{"$f":"VLOOKUP(A266,txt!A:A,1,0)","v":{"$error":"#N/A"}}]
["239.77.1.166:5146",{"$f":"VLOOKUP(A267,txt!A:A,1,0)","v":"239.77.1.166:5146"}]
["#EXTINF:-1 tvg-name=\"CCTV-4\" group-title=\"IPTV-央视\",CCTV-4高清",{"$f":"VLOOKUP(A268,txt!A:A,1,0)","v":{"$error":"#N/A"}}]
["239.77.0.78:5146",{"$f":"VLOOKUP(A269,txt!A:A,1,0)","v":"239.77.0.78:5146"}]
["#EXTINF:-1 tvg-name=\"CCTV-4美洲\" group-title=\"IPTV-央视\",CCTV-4美洲高清",{"$f":"VLOOKUP(A270,txt!A:A,1,0)","v":{"$error":"#N/A"}}]
["239.253.43.121:5146",{"$f":"VLOOKUP(A271,txt!A:A,1,0)","v":"239.253.43.121:5146"}]
["#EXTINF:-1 tvg-name=\"CCTV-4欧洲\" group-title=\"IPTV-央视\",CCTV-4欧洲高清",{"$f":"VLOOKUP(A272,txt!A:A,1,0)","v":{"$error":"#N/A"}}]
["239.253.43.120:5146",{"$f":"VLOOKUP(A273,txt!A:A,1,0)","v":"239.253.43.120:5146"}]
["#EXTINF:-1 tvg-name=\"CCTV-5\" group-title=\"IPTV-央视\",CCTV-5体育",{"$f":"VLOOKUP(A274,txt!A:A,1,0)","v":{"$error":"#N/A"}}]
["239.77.0.34:5146",{"$f":"VLOOKUP(A275,txt!A:A,1,0)","v":"239.77.0.34:5146"}]
["#EXTINF:-1 tvg-name=\"CCTV-5\" group-title=\"IPTV-央视\",CCTV-5高清",{"$f":"VLOOKUP(A276,txt!A:A,1,0)","v":{"$error":"#N/A"}}]
["239.77.0.170:5146",{"$f":"VLOOKUP(A277,txt!A:A,1,0)","v":"239.77.0.170:5146"}]
["#EXTINF:-1 tvg-name=\"CCTV-5\" group-title=\"IPTV-央视\",CCTV-5超清 (CAVS)",{"$f":"VLOOKUP(A278,txt!A:A,1,0)","v":{"$error":"#N/A"}}]
["239.77.0.177:5146",{"$f":"VLOOKUP(A279,txt!A:A,1,0)","v":"239.77.0.177:5146"}]
["#EXTINF:-1 tvg-name=\"CCTV-5+\" group-title=\"IPTV-央视\",CCTV-5+高清",{"$f":"VLOOKUP(A280,txt!A:A,1,0)","v":{"$error":"#N/A"}}]
["239.77.0.87:5146",{"$f":"VLOOKUP(A281,txt!A:A,1,0)","v":"239.77.0.87:5146"}]
["#EXTINF:-1 tvg-name=\"CCTV-5+\" group-title=\"IPTV-央视\",CCTV-5+高清",{"$f":"VLOOKUP(A282,txt!A:A,1,0)","v":{"$error":"#N/A"}}]
["239.77.1.31:5146",{"$f":"VLOOKUP(A283,txt!A:A,1,0)","v":"239.77.1.31:5146"}]
["#EXTINF:-1 tvg-name=\"CCTV-5+\" group-title=\"IPTV-央视\",CCTV-5+高清",{"$f":"VLOOKUP(A284,txt!A:A,1,0)","v":{"$error":"#N/A"}}]
["239.77.1.147:5146",{"$f":"VLOOKUP(A285,txt!A:A,1,0)","v":"239.77.1.147:5146"}]
["#EXTINF:-1 tvg-name=\"CCTV-6\" group-title=\"IPTV-央视\",CCTV-6电影",{"$f":"VLOOKUP(A286,txt!A:A,1,0)","v":{"$error":"#N/A"}}]
["239.77.0.35:5146",{"$f":"VLOOKUP(A287,txt!A:A,1,0)","v":"239.77.0.35:5146"}]
["#EXTINF:-1 tvg-name=\"CCTV-6\" group-title=\"IPTV-央视\",CCTV-6高清",{"$f":"VLOOKUP(A288,txt!A:A,1,0)","v":{"$error":"#N/A"}}]
["239.77.0.171:5146",{"$f":"VLOOKUP(A289,txt!A:A,1,0)","v":"239.77.0.171:5146"}]
["#EXTINF:-1 tvg-name=\"CCTV-6\" group-title=\"IPTV-央视\",CCTV-6超清 (CAVS)",{"$f":"VLOOKUP(A290,txt!A:A,1,0)","v":{"$error":"#N/A"}}]
["239.77.0.178:5146",{"$f":"VLOOKUP(A291,txt!A:A,1,0)","v":"239.77.0.178:5146"}]
["#EXTINF:-1 tvg-name=\"CCTV-7\" group-title=\"IPTV-央视\",CCTV-7国防军事",{"$f":"VLOOKUP(A292,txt!A:A,1,0)","v":{"$error":"#N/A"}}]
["239.77.0.36:5146",{"$f":"VLOOKUP(A293,txt!A:A,1,0)","v":"239.77.0.36:5146"}]
["#EXTINF:-1 tvg-name=\"CCTV-7\" group-title=\"IPTV-央视\",CCTV-7高清",{"$f":"VLOOKUP(A294,txt!A:A,1,0)","v":{"$error":"#N/A"}}]
["239.77.1.159:5146",{"$f":"VLOOKUP(A295,txt!A:A,1,0)","v":"239.77.1.159:5146"}]
["#EXTINF:-1 tvg-name=\"CCTV-7\" group-title=\"IPTV-央视\",CCTV-7高清 (CAVS)",{"$f":"VLOOKUP(A296,txt!A:A,1,0)","v":{"$error":"#N/A"}}]
["239.77.1.167:5146",{"$f":"VLOOKUP(A297,txt!A:A,1,0)","v":"239.77.1.167:5146"}]
["#EXTINF:-1 tvg-name=\"CCTV-7\" group-title=\"IPTV-央视\",CCTV-7高清测试(CCTV -7军事农业高清)",{"$f":"VLOOKUP(A298,txt!A:A,1,0)","v":{"$error":"#N/A"}}]
["239.77.0.138:5146",{"$f":"VLOOKUP(A299,txt!A:A,1,0)","v":"239.77.0.138:5146"}]
["#EXTINF:-1 tvg-name=\"CCTV-8\" group-title=\"IPTV-央视\",CCTV-8电视剧",{"$f":"VLOOKUP(A300,txt!A:A,1,0)","v":{"$error":"#N/A"}}]
["239.77.0.37:5146",{"$f":"VLOOKUP(A301,txt!A:A,1,0)","v":"239.77.0.37:5146"}]
["#EXTINF:-1 tvg-name=\"CCTV-8\" group-title=\"IPTV-央视\",CCTV-8高清",{"$f":"VLOOKUP(A302,txt!A:A,1,0)","v":{"$error":"#N/A"}}]
["239.77.0.172:5146",{"$f":"VLOOKUP(A303,txt!A:A,1,0)","v":"239.77.0.172:5146"}]
["#EXTINF:-1 tvg-name=\"CCTV-8\" group-title=\"IPTV-央视\",CCTV-8超清 (CAVS)",{"$f":"VLOOKUP(A304,txt!A:A,1,0)","v":{"$error":"#N/A"}}]
["239.77.0.181:5146",{"$f":"VLOOKUP(A305,txt!A:A,1,0)","v":"239.77.0.181:5146"}]
["#EXTINF:-1 tvg-name=\"CCTV-9\" group-title=\"IPTV-央视\",CCTV-9纪录",{"$f":"VLOOKUP(A306,txt!A:A,1,0)","v":{"$error":"#N/A"}}]
["239.77.0.38:5146",{"$f":"VLOOKUP(A307,txt!A:A,1,0)","v":"239.77.0.38:5146"}]
["#EXTINF:-1 tvg-name=\"CCTV-9\" group-title=\"IPTV-央视\",CCTV-9高清",{"$f":"VLOOKUP(A308,txt!A:A,1,0)","v":{"$error":"#N/A"}}]
["239.77.1.160:5146",{"$f":"VLOOKUP(A309,txt!A:A,1,0)","v":"239.77.1.160:5146"}]
["#EXTINF:-1 tvg-name=\"CCTV-9\" group-title=\"IPTV-央视\",CCTV-9高清 (CAVS)",{"$f":"VLOOKUP(A310,txt!A:A,1,0)","v":{"$error":"#N/A"}}]
["239.77.1.168:5146",{"$f":"VLOOKUP(A311,txt!A:A,1,0)","v":"239.77.1.168:5146"}]
["#EXTINF:-1 tvg-name=\"CCTV-9\" group-title=\"IPTV-央视\",CCTV-9高清测试",{"$f":"VLOOKUP(A312,txt!A:A,1,0)","v":{"$error":"#N/A"}}]
["239.77.0.135:5146",{"$f":"VLOOKUP(A313,txt!A:A,1,0)","v":"239.77.0.135:5146"}]
["#EXTINF:-1 tvg-name=\"CCTV-10\" group-title=\"IPTV-央视\",CCTV-10科教",{"$f":"VLOOKUP(A314,txt!A:A,1,0)","v":{"$error":"#N/A"}}]
["239.77.0.39:5146",{"$f":"VLOOKUP(A315,txt!A:A,1,0)","v":"239.77.0.39:5146"}]
["#EXTINF:-1 tvg-name=\"CCTV-10\" group-title=\"IPTV-央视\",CCTV-10高清",{"$f":"VLOOKUP(A316,txt!A:A,1,0)","v":{"$error":"#N/A"}}]
["239.77.1.113:5146",{"$f":"VLOOKUP(A317,txt!A:A,1,0)","v":"239.77.1.113:5146"}]
["#EXTINF:-1 tvg-name=\"CCTV-10\" group-title=\"IPTV-央视\",CCTV-10高清 (CAVS)",{"$f":"VLOOKUP(A318,txt!A:A,1,0)","v":{"$error":"#N/A"}}]
["239.77.1.169:5146",{"$f":"VLOOKUP(A319,txt!A:A,1,0)","v":"239.77.1.169:5146"}]
["#EXTINF:-1 tvg-name=\"CCTV-10\" group-title=\"IPTV-央视\",CCTV-10高清测试(CCTV-10科教高清)",{"$f":"VLOOKUP(A320,txt!A:A,1,0)","v":{"$error":"#N/A"}}]
["239.77.0.134:5146",{"$f":"VLOOKUP(A321,txt!A:A,1,0)","v":"239.77.0.134:5146"}]
["#EXTINF:-1 tvg-name=\"CCTV-11\" group-title=\"IPTV-央视\",CCTV-11戏曲",{"$f":"VLOOKUP(A322,txt!A:A,1,0)","v":{"$error":"#N/A"}}]
["239.77.0.40:5146",{"$f":"VLOOKUP(A323,txt!A:A,1,0)","v":"239.77.0.40:5146"}]
["#EXTINF:-1 tvg-name=\"CCTV-11\" group-title=\"IPTV-央视\",CCTV-11",{"$f":"VLOOKUP(A324,txt!A:A,1,0)","v":{"$error":"#N/A"}}]
["239.77.1.42:5146",{"$f":"VLOOKUP(A325,txt!A:A,1,0)","v":"239.77.1.42:5146"}]
["#EXTINF:-1 tvg-name=\"CCTV-11\" group-title=\"IPTV-央视\",CCTV-11高清",{"$f":"VLOOKUP(A326,txt!A:A,1,0)","v":{"$error":"#N/A"}}]
["239.77.1.108:5146",{"$f":"VLOOKUP(A327,txt!A:A,1,0)","v":"239.77.1.108:5146"}]
["#EXTINF:-1 tvg-name=\"CCTV-11\" group-title=\"IPTV-央视\",CCTV-11高清",{"$f":"VLOOKUP(A328,txt!A:A,1,0)","v":{"$error":"#N/A"}}]
["239.77.1.238:5146",{"$f":"VLOOKUP(A329,txt!A:A,1,0)","v":"239.77.1.238:5146"}]
["#EXTINF:-1 tvg-name=\"CCTV-12\" group-title=\"IPTV-央视\",CCTV-12社会与法",{"$f":"VLOOKUP(A330,txt!A:A,1,0)","v":{"$error":"#N/A"}}]
["239.77.0.41:5146",{"$f":"VLOOKUP(A331,txt!A:A,1,0)","v":"239.77.0.41:5146"}]
["#EXTINF:-1 tvg-name=\"CCTV-12\" group-title=\"IPTV-央视\",CCTV-12高清",{"$f":"VLOOKUP(A332,txt!A:A,1,0)","v":{"$error":"#N/A"}}]
["239.77.1.109:5146",{"$f":"VLOOKUP(A333,txt!A:A,1,0)","v":"239.77.1.109:5146"}]
["#EXTINF:-1 tvg-name=\"CCTV-12\" group-title=\"IPTV-央视\",CCTV-12高清 (CAVS)",{"$f":"VLOOKUP(A334,txt!A:A,1,0)","v":{"$error":"#N/A"}}]
["239.77.1.170:5146",{"$f":"VLOOKUP(A335,txt!A:A,1,0)","v":"239.77.1.170:5146"}]
["#EXTINF:-1 tvg-name=\"CCTV-12\" group-title=\"IPTV-央视\",CCTV-12高清测试",{"$f":"VLOOKUP(A336,txt!A:A,1,0)","v":{"$error":"#N/A"}}]
["239.77.0.136:5146",{"$f":"VLOOKUP(A337,txt!A:A,1,0)","v":"239.77.0.136:5146"}]
["#EXTINF:-1 tvg-name=\"CCTV-13\" group-title=\"IPTV-央视\",CCTV-13新闻",{"$f":"VLOOKUP(A338,txt!A:A,1,0)","v":{"$error":"#N/A"}}]
["239.77.0.42:5146",{"$f":"VLOOKUP(A339,txt!A:A,1,0)","v":"239.77.0.42:5146"}]
["#EXTINF:-1 tvg-name=\"CCTV-13\" group-title=\"IPTV-央视\",CCTV-13高清",{"$f":"VLOOKUP(A340,txt!A:A,1,0)","v":{"$error":"#N/A"}}]
["239.77.0.188:5146",{"$f":"VLOOKUP(A341,txt!A:A,1,0)","v":"239.77.0.188:5146"}]
["#EXTINF:-1 tvg-name=\"CCTV-13\" group-title=\"IPTV-央视\",CCTV-13高清",{"$f":"VLOOKUP(A342,txt!A:A,1,0)","v":{"$error":"#N/A"}}]
["239.253.43.196:5146",{"$f":"VLOOKUP(A343,txt!A:A,1,0)","v":"239.253.43.196:5146"}]
["#EXTINF:-1 tvg-name=\"CCTV-14\" group-title=\"IPTV-央视\",CCTV-14少儿",{"$f":"VLOOKUP(A344,txt!A:A,1,0)","v":{"$error":"#N/A"}}]
["239.77.0.43:5146",{"$f":"VLOOKUP(A345,txt!A:A,1,0)","v":"239.77.0.43:5146"}]
["#EXTINF:-1 tvg-name=\"CCTV-14\" group-title=\"IPTV-央视\",CCTV-14高清",{"$f":"VLOOKUP(A346,txt!A:A,1,0)","v":{"$error":"#N/A"}}]
["239.77.1.161:5146",{"$f":"VLOOKUP(A347,txt!A:A,1,0)","v":"239.77.1.161:5146"}]
["#EXTINF:-1 tvg-name=\"CCTV-14\" group-title=\"IPTV-央视\",CCTV-14高清 (CAVS)",{"$f":"VLOOKUP(A348,txt!A:A,1,0)","v":{"$error":"#N/A"}}]
["239.77.1.171:5146",{"$f":"VLOOKUP(A349,txt!A:A,1,0)","v":"239.77.1.171:5146"}]
["#EXTINF:-1 tvg-name=\"CCTV-14\" group-title=\"IPTV-央视\",CCTV-14高清测试",{"$f":"VLOOKUP(A350,txt!A:A,1,0)","v":{"$error":"#N/A"}}]
["239.77.0.133:5146",{"$f":"VLOOKUP(A351,txt!A:A,1,0)","v":"239.77.0.133:5146"}]
["#EXTINF:-1 tvg-name=\"CCTV-15\" group-title=\"IPTV-央视\",CCTV-15音乐",{"$f":"VLOOKUP(A352,txt!A:A,1,0)","v":{"$error":"#N/A"}}]
["239.77.0.44:5146",{"$f":"VLOOKUP(A353,txt!A:A,1,0)","v":"239.77.0.44:5146"}]
["#EXTINF:-1 tvg-name=\"CCTV-15\" group-title=\"IPTV-央视\",CCTV-15",{"$f":"VLOOKUP(A354,txt!A:A,1,0)","v":{"$error":"#N/A"}}]
["239.77.1.11:5146",{"$f":"VLOOKUP(A355,txt!A:A,1,0)","v":"239.77.1.11:5146"}]
["#EXTINF:-1 tvg-name=\"CCTV-15\" group-title=\"IPTV-央视\",CCTV-15高清",{"$f":"VLOOKUP(A356,txt!A:A,1,0)","v":{"$error":"#N/A"}}]
["239.77.1.120:5146",{"$f":"VLOOKUP(A357,txt!A:A,1,0)","v":"239.77.1.120:5146"}]
["#EXTINF:-1 tvg-name=\"CCTV-15\" group-title=\"IPTV-央视\",CCTV-15高清",{"$f":"VLOOKUP(A358,txt!A:A,1,0)","v":{"$error":"#N/A"}}]
["239.77.1.239:5146",{"$f":"VLOOKUP(A359,txt!A:A,1,0)","v":"239.77.1.239:5146"}]
["#EXTINF:-1 tvg-name=\"CCTV-16\" group-title=\"IPTV-央视\",CCTV-16高清",{"$f":"VLOOKUP(A360,txt!A:A,1,0)","v":{"$error":"#N/A"}}]
["239.77.0.165:5146",{"$f":"VLOOKUP(A361,txt!A:A,1,0)","v":"239.77.0.165:5146"}]
["#EXTINF:-1 tvg-name=\"CCTV-17\" group-title=\"IPTV-央视\",CCTV-17农业",{"$f":"VLOOKUP(A362,txt!A:A,1,0)","v":{"$error":"#N/A"}}]
["239.77.0.115:5146",{"$f":"VLOOKUP(A363,txt!A:A,1,0)","v":"239.77.0.115:5146"}]
["#EXTINF:-1 tvg-name=\"CCTV-17\" group-title=\"IPTV-央视\",CCTV-17高清",{"$f":"VLOOKUP(A364,txt!A:A,1,0)","v":{"$error":"#N/A"}}]
["239.77.1.121:5146",{"$f":"VLOOKUP(A365,txt!A:A,1,0)","v":"239.77.1.121:5146"}]
["#EXTINF:-1 tvg-name=\"CCTV-17\" group-title=\"IPTV-央视\",CCTV-17农业高清",{"$f":"VLOOKUP(A366,txt!A:A,1,0)","v":{"$error":"#N/A"}}]
["239.77.0.198:5146",{"$f":"VLOOKUP(A367,txt!A:A,1,0)","v":"239.77.0.198:5146"}]
["#EXTINF:-1 tvg-name=\"CCTV-4K\" group-title=\"IPTV-央视\",CCTV-4K 4K",{"$f":"VLOOKUP(A368,txt!A:A,1,0)","v":{"$error":"#N/A"}}]
["239.77.0.194:5146",{"$f":"VLOOKUP(A369,txt!A:A,1,0)","v":"239.77.0.194:5146"}]
["#EXTINF:-1 tvg-name=\"CCTV-4K\" group-title=\"IPTV-央视\",CCTV-4K 4K50p",{"$f":"VLOOKUP(A370,txt!A:A,1,0)","v":{"$error":"#N/A"}}]
["239.77.0.174:5146",{"$f":"VLOOKUP(A371,txt!A:A,1,0)","v":"239.77.0.174:5146"}]
["#EXTINF:-1 tvg-name=\"CCTV-4K\" group-title=\"IPTV-央视\",CCTV-4K 4K",{"$f":"VLOOKUP(A372,txt!A:A,1,0)","v":{"$error":"#N/A"}}]
["239.77.1.180:5146",{"$f":"VLOOKUP(A373,txt!A:A,1,0)","v":"239.77.1.180:5146"}]
["#EXTINF:-1 tvg-name=\"CGTN\" group-title=\"IPTV-央视\",CGTN",{"$f":"VLOOKUP(A374,txt!A:A,1,0)","v":{"$error":"#N/A"}}]
["239.77.0.45:5146",{"$f":"VLOOKUP(A375,txt!A:A,1,0)","v":"239.77.0.45:5146"}]
["#EXTINF:-1 tvg-name=\"CGTN\" group-title=\"IPTV-央视\",CGTN",{"$f":"VLOOKUP(A376,txt!A:A,1,0)","v":{"$error":"#N/A"}}]
["239.77.1.27:5146",{"$f":"VLOOKUP(A377,txt!A:A,1,0)","v":"239.77.1.27:5146"}]
["#EXTINF:-1 tvg-name=\"CGTN\" group-title=\"IPTV-央视\",CGTN英语高清",{"$f":"VLOOKUP(A378,txt!A:A,1,0)","v":{"$error":"#N/A"}}]
["239.77.0.199:5146",{"$f":"VLOOKUP(A379,txt!A:A,1,0)","v":"239.77.0.199:5146"}]
["#EXTINF:-1 tvg-name=\"CGTN Documentary\" group-title=\"IPTV-央视\",CGTN Documentary高清",{"$f":"VLOOKUP(A380,txt!A:A,1,0)","v":{"$error":"#N/A"}}]
["239.253.43.122:5146",{"$f":"VLOOKUP(A381,txt!A:A,1,0)","v":"239.253.43.122:5146"}]
["#EXTINF:-1 tvg-name=\"CGTN西班牙语\" group-title=\"IPTV-央视\",CGTN西班牙语高清",{"$f":"VLOOKUP(A382,txt!A:A,1,0)","v":{"$error":"#N/A"}}]
["239.77.0.221:5146",{"$f":"VLOOKUP(A383,txt!A:A,1,0)","v":"239.77.0.221:5146"}]
["#EXTINF:-1 tvg-name=\"CGTN法语\" group-title=\"IPTV-央视\",CGTN法语高清",{"$f":"VLOOKUP(A384,txt!A:A,1,0)","v":{"$error":"#N/A"}}]
["239.77.0.228:5146",{"$f":"VLOOKUP(A385,txt!A:A,1,0)","v":"239.77.0.228:5146"}]
["#EXTINF:-1 tvg-name=\"CGTN阿拉伯语\" group-title=\"IPTV-央视\",CGTN阿拉伯语高清",{"$f":"VLOOKUP(A386,txt!A:A,1,0)","v":{"$error":"#N/A"}}]
["239.253.43.200:5146",{"$f":"VLOOKUP(A387,txt!A:A,1,0)","v":"239.253.43.200:5146"}]
["#EXTINF:-1 tvg-name=\"CGTN俄语\" group-title=\"IPTV-央视\",CGTN俄语高清",{"$f":"VLOOKUP(A388,txt!A:A,1,0)","v":{"$error":"#N/A"}}]
["239.253.43.201:5146",{"$f":"VLOOKUP(A389,txt!A:A,1,0)","v":"239.253.43.201:5146"}]
["#EXTINF:-1 tvg-name=\"湖南卫视\" group-title=\"IPTV-卫视\",湖南卫视",{"$f":"VLOOKUP(A390,txt!A:A,1,0)","v":{"$error":"#N/A"}}]
["239.77.0.46:5146",{"$f":"VLOOKUP(A391,txt!A:A,1,0)","v":{"$error":"#N/A"}}]
["#EXTINF:-1 tvg-name=\"湖南卫视\" group-title=\"IPTV-卫视\",湖南卫视高清",{"$f":"VLOOKUP(A392,txt!A:A,1,0)","v":{"$error":"#N/A"}}]
["239.77.1.5:5146",{"$f":"VLOOKUP(A393,txt!A:A,1,0)","v":"239.77.1.5:5146"}]
["#EXTINF:-1 tvg-name=\"湖南卫视\" group-title=\"IPTV-卫视\",湖南卫视高清 (CAVS)",{"$f":"VLOOKUP(A394,txt!A:A,1,0)","v":{"$error":"#N/A"}}]
["239.77.1.129:5146",{"$f":"VLOOKUP(A395,txt!A:A,1,0)","v":"239.77.1.129:5146"}]
["#EXTINF:-1 tvg-name=\"湖南卫视\" group-title=\"IPTV-卫视\",湖南卫视高清",{"$f":"VLOOKUP(A396,txt!A:A,1,0)","v":{"$error":"#N/A"}}]
["239.77.0.88:5146",{"$f":"VLOOKUP(A397,txt!A:A,1,0)","v":"239.77.0.88:5146"}]
["#EXTINF:-1 tvg-name=\"湖南卫视\" group-title=\"IPTV-卫视\",湖南卫视超清 (CAVS)",{"$f":"VLOOKUP(A398,txt!A:A,1,0)","v":{"$error":"#N/A"}}]
["239.77.0.127:5146",{"$f":"VLOOKUP(A399,txt!A:A,1,0)","v":"239.77.0.127:5146"}]
["#EXTINF:-1 tvg-name=\"浙江卫视\" group-title=\"IPTV-卫视\",浙江卫视",{"$f":"VLOOKUP(A400,txt!A:A,1,0)","v":{"$error":"#N/A"}}]
["239.77.0.47:5146",{"$f":"VLOOKUP(A401,txt!A:A,1,0)","v":{"$error":"#N/A"}}]
["#EXTINF:-1 tvg-name=\"浙江卫视\" group-title=\"IPTV-卫视\",浙江卫视高清",{"$f":"VLOOKUP(A402,txt!A:A,1,0)","v":{"$error":"#N/A"}}]
["239.77.1.33:5146",{"$f":"VLOOKUP(A403,txt!A:A,1,0)","v":"239.77.1.33:5146"}]
["#EXTINF:-1 tvg-name=\"浙江卫视\" group-title=\"IPTV-卫视\",浙江卫视高清 (CAVS)",{"$f":"VLOOKUP(A404,txt!A:A,1,0)","v":{"$error":"#N/A"}}]
["239.77.1.150:5146",{"$f":"VLOOKUP(A405,txt!A:A,1,0)","v":"239.77.1.150:5146"}]
["#EXTINF:-1 tvg-name=\"浙江卫视\" group-title=\"IPTV-卫视\",浙江卫视高清",{"$f":"VLOOKUP(A406,txt!A:A,1,0)","v":{"$error":"#N/A"}}]
["239.77.0.89:5146",{"$f":"VLOOKUP(A407,txt!A:A,1,0)","v":"239.77.0.89:5146"}]
["#EXTINF:-1 tvg-name=\"浙江卫视\" group-title=\"IPTV-卫视\",浙江卫视超清 (CAVS)",{"$f":"VLOOKUP(A408,txt!A:A,1,0)","v":{"$error":"#N/A"}}]
["239.77.0.125:5146",{"$f":"VLOOKUP(A409,txt!A:A,1,0)","v":"239.77.0.125:5146"}]
["#EXTINF:-1 tvg-name=\"江苏卫视\" group-title=\"IPTV-卫视\",江苏卫视",{"$f":"VLOOKUP(A410,txt!A:A,1,0)","v":{"$error":"#N/A"}}]
["239.77.0.48:5146",{"$f":"VLOOKUP(A411,txt!A:A,1,0)","v":{"$error":"#N/A"}}]
["#EXTINF:-1 tvg-name=\"江苏卫视\" group-title=\"IPTV-卫视\",江苏卫视高清",{"$f":"VLOOKUP(A412,txt!A:A,1,0)","v":{"$error":"#N/A"}}]
["239.77.1.18:5146",{"$f":"VLOOKUP(A413,txt!A:A,1,0)","v":"239.77.1.18:5146"}]
["#EXTINF:-1 tvg-name=\"江苏卫视\" group-title=\"IPTV-卫视\",江苏卫视高清 (CAVS)",{"$f":"VLOOKUP(A414,txt!A:A,1,0)","v":{"$error":"#N/A"}}]
["239.77.1.149:5146",{"$f":"VLOOKUP(A415,txt!A:A,1,0)","v":"239.77.1.149:5146"}]
["#EXTINF:-1 tvg-name=\"江苏卫视\" group-title=\"IPTV-卫视\",江苏卫视高清",{"$f":"VLOOKUP(A416,txt!A:A,1,0)","v":{"$error":"#N/A"}}]
["239.77.0.90:5146",{"$f":"VLOOKUP(A417,txt!A:A,1,0)","v":"239.77.0.90:5146"}]
["#EXTINF:-1 tvg-name=\"江苏卫视\" group-title=\"IPTV-卫视\",江苏卫视超清 (CAVS)",{"$f":"VLOOKUP(A418,txt!A:A,1,0)","v":{"$error":"#N/A"}}]
["239.77.0.126:5146",{"$f":"VLOOKUP(A419,txt!A:A,1,0)","v":"239.77.0.126:5146"}]
["#EXTINF:-1 tvg-name=\"东方卫视\" group-title=\"IPTV-卫视\",东方卫视",{"$f":"VLOOKUP(A420,txt!A:A,1,0)","v":{"$error":"#N/A"}}]
["239.77.0.49:5146",{"$f":"VLOOKUP(A421,txt!A:A,1,0)","v":{"$error":"#N/A"}}]
["#EXTINF:-1 tvg-name=\"东方卫视\" group-title=\"IPTV-卫视\",东方卫视高清",{"$f":"VLOOKUP(A422,txt!A:A,1,0)","v":{"$error":"#N/A"}}]
["239.77.1.218:5146",{"$f":"VLOOKUP(A423,txt!A:A,1,0)","v":"239.77.1.218:5146"}]
["#EXTINF:-1 tvg-name=\"东方卫视\" group-title=\"IPTV-卫视\",东方卫视高清 (CAVS)",{"$f":"VLOOKUP(A424,txt!A:A,1,0)","v":{"$error":"#N/A"}}]
["239.77.1.156:5146",{"$f":"VLOOKUP(A425,txt!A:A,1,0)","v":"239.77.1.156:5146"}]
["#EXTINF:-1 tvg-name=\"东方卫视\" group-title=\"IPTV-卫视\",东方卫视高清",{"$f":"VLOOKUP(A426,txt!A:A,1,0)","v":{"$error":"#N/A"}}]
["239.77.0.98:5146",{"$f":"VLOOKUP(A427,txt!A:A,1,0)","v":"239.77.0.98:5146"}]
["#EXTINF:-1 tvg-name=\"安徽卫视\" group-title=\"IPTV-卫视\",安徽卫视",{"$f":"VLOOKUP(A428,txt!A:A,1,0)","v":{"$error":"#N/A"}}]
["239.77.0.50:5146",{"$f":"VLOOKUP(A429,txt!A:A,1,0)","v":{"$error":"#N/A"}}]
["#EXTINF:-1 tvg-name=\"安徽卫视\" group-title=\"IPTV-卫视\",安徽卫视高清",{"$f":"VLOOKUP(A430,txt!A:A,1,0)","v":{"$error":"#N/A"}}]
["239.77.1.92:5146",{"$f":"VLOOKUP(A431,txt!A:A,1,0)","v":"239.77.1.92:5146"}]
["#EXTINF:-1 tvg-name=\"安徽卫视\" group-title=\"IPTV-卫视\",安徽卫视高清 (CAVS)",{"$f":"VLOOKUP(A432,txt!A:A,1,0)","v":{"$error":"#N/A"}}]
["239.77.1.157:5146",{"$f":"VLOOKUP(A433,txt!A:A,1,0)","v":"239.77.1.157:5146"}]
["#EXTINF:-1 tvg-name=\"安徽卫视\" group-title=\"IPTV-卫视\",安徽卫视高清",{"$f":"VLOOKUP(A434,txt!A:A,1,0)","v":{"$error":"#N/A"}}]
["239.77.0.183:5146",{"$f":"VLOOKUP(A435,txt!A:A,1,0)","v":"239.77.0.183:5146"}]
["#EXTINF:-1 tvg-name=\"北京卫视\" group-title=\"IPTV-卫视\",北京卫视",{"$f":"VLOOKUP(A436,txt!A:A,1,0)","v":{"$error":"#N/A"}}]
["239.77.0.51:5146",{"$f":"VLOOKUP(A437,txt!A:A,1,0)","v":{"$error":"#N/A"}}]
["#EXTINF:-1 tvg-name=\"北京卫视\" group-title=\"IPTV-卫视\",北京卫视高清",{"$f":"VLOOKUP(A438,txt!A:A,1,0)","v":{"$error":"#N/A"}}]
["239.77.1.4:5146",{"$f":"VLOOKUP(A439,txt!A:A,1,0)","v":"239.77.1.4:5146"}]
["#EXTINF:-1 tvg-name=\"北京卫视\" group-title=\"IPTV-卫视\",北京卫视高清",{"$f":"VLOOKUP(A440,txt!A:A,1,0)","v":{"$error":"#N/A"}}]
["239.77.1.151:5146",{"$f":"VLOOKUP(A441,txt!A:A,1,0)","v":"239.77.1.151:5146"}]
["#EXTINF:-1 tvg-name=\"北京卫视\" group-title=\"IPTV-卫视\",北京卫视高清",{"$f":"VLOOKUP(A442,txt!A:A,1,0)","v":{"$error":"#N/A"}}]
["239.77.0.91:5146",{"$f":"VLOOKUP(A443,txt!A:A,1,0)","v":"239.77.0.91:5146"}]
["#EXTINF:-1 tvg-name=\"北京卫视\" group-title=\"IPTV-卫视\",北京卫视 4K",{"$f":"VLOOKUP(A444,txt!A:A,1,0)","v":{"$error":"#N/A"}}]
["239.77.0.2:5146",{"$f":"VLOOKUP(A445,txt!A:A,1,0)","v":"239.77.0.2:5146"}]
["#EXTINF:-1 tvg-name=\"天津卫视\" group-title=\"IPTV-卫视\",天津卫视",{"$f":"VLOOKUP(A446,txt!A:A,1,0)","v":{"$error":"#N/A"}}]
["239.77.0.52:5146",{"$f":"VLOOKUP(A447,txt!A:A,1,0)","v":{"$error":"#N/A"}}]
["#EXTINF:-1 tvg-name=\"天津卫视\" group-title=\"IPTV-卫视\",天津卫视高清",{"$f":"VLOOKUP(A448,txt!A:A,1,0)","v":{"$error":"#N/A"}}]
["239.77.1.141:5146",{"$f":"VLOOKUP(A449,txt!A:A,1,0)","v":"239.77.1.141:5146"}]
["#EXTINF:-1 tvg-name=\"天津卫视\" group-title=\"IPTV-卫视\",天津卫视高清",{"$f":"VLOOKUP(A450,txt!A:A,1,0)","v":{"$error":"#N/A"}}]
["239.77.1.182:5146",{"$f":"VLOOKUP(A451,txt!A:A,1,0)","v":"239.77.1.182:5146"}]
["#EXTINF:-1 tvg-name=\"天津卫视\" group-title=\"IPTV-卫视\",天津卫视高清",{"$f":"VLOOKUP(A452,txt!A:A,1,0)","v":{"$error":"#N/A"}}]
["239.77.0.97:5146",{"$f":"VLOOKUP(A453,txt!A:A,1,0)","v":"239.77.0.97:5146"}]
["#EXTINF:-1 tvg-name=\"天津卫视\" group-title=\"IPTV-卫视\",天津卫视超清",{"$f":"VLOOKUP(A454,txt!A:A,1,0)","v":{"$error":"#N/A"}}]
["239.77.0.131:5146",{"$f":"VLOOKUP(A455,txt!A:A,1,0)","v":"239.77.0.131:5146"}]
["#EXTINF:-1 tvg-name=\"山东卫视\" group-title=\"IPTV-卫视\",山东卫视",{"$f":"VLOOKUP(A456,txt!A:A,1,0)","v":{"$error":"#N/A"}}]
["239.77.0.53:5146",{"$f":"VLOOKUP(A457,txt!A:A,1,0)","v":{"$error":"#N/A"}}]
["#EXTINF:-1 tvg-name=\"山东卫视\" group-title=\"IPTV-卫视\",山东卫视高清",{"$f":"VLOOKUP(A458,txt!A:A,1,0)","v":{"$error":"#N/A"}}]
["239.77.1.142:5146",{"$f":"VLOOKUP(A459,txt!A:A,1,0)","v":"239.77.1.142:5146"}]
["#EXTINF:-1 tvg-name=\"山东卫视\" group-title=\"IPTV-卫视\",山东卫视高清 (CAVS)",{"$f":"VLOOKUP(A460,txt!A:A,1,0)","v":{"$error":"#N/A"}}]
["239.77.1.153:5146",{"$f":"VLOOKUP(A461,txt!A:A,1,0)","v":"239.77.1.153:5146"}]
["#EXTINF:-1 tvg-name=\"山东卫视\" group-title=\"IPTV-卫视\",山东卫视高清",{"$f":"VLOOKUP(A462,txt!A:A,1,0)","v":{"$error":"#N/A"}}]
["239.77.0.94:5146",{"$f":"VLOOKUP(A463,txt!A:A,1,0)","v":"239.77.0.94:5146"}]
["#EXTINF:-1 tvg-name=\"山东卫视\" group-title=\"IPTV-卫视\",山东卫视超清 (CAVS)",{"$f":"VLOOKUP(A464,txt!A:A,1,0)","v":{"$error":"#N/A"}}]
["239.77.0.132:5146",{"$f":"VLOOKUP(A465,txt!A:A,1,0)","v":"239.77.0.132:5146"}]
["#EXTINF:-1 tvg-name=\"江西卫视\" group-title=\"IPTV-卫视\",江西卫视",{"$f":"VLOOKUP(A466,txt!A:A,1,0)","v":{"$error":"#N/A"}}]
["239.77.0.54:5146",{"$f":"VLOOKUP(A467,txt!A:A,1,0)","v":{"$error":"#N/A"}}]
["#EXTINF:-1 tvg-name=\"江西卫视\" group-title=\"IPTV-卫视\",江西卫视高清",{"$f":"VLOOKUP(A468,txt!A:A,1,0)","v":{"$error":"#N/A"}}]
["239.77.1.219:5146",{"$f":"VLOOKUP(A469,txt!A:A,1,0)","v":"239.77.1.219:5146"}]
["#EXTINF:-1 tvg-name=\"江西卫视\" group-title=\"IPTV-卫视\",江西卫视高清",{"$f":"VLOOKUP(A470,txt!A:A,1,0)","v":{"$error":"#N/A"}}]
["239.77.0.149:5146",{"$f":"VLOOKUP(A471,txt!A:A,1,0)","v":"239.77.0.149:5146"}]
["#EXTINF:-1 tvg-name=\"湖北卫视\" group-title=\"IPTV-卫视\",湖北卫视",{"$f":"VLOOKUP(A472,txt!A:A,1,0)","v":{"$error":"#N/A"}}]
["239.77.0.56:5146",{"$f":"VLOOKUP(A473,txt!A:A,1,0)","v":{"$error":"#N/A"}}]
["#EXTINF:-1 tvg-name=\"湖北卫视\" group-title=\"IPTV-卫视\",湖北卫视高清",{"$f":"VLOOKUP(A474,txt!A:A,1,0)","v":{"$error":"#N/A"}}]
["239.77.1.93:5146",{"$f":"VLOOKUP(A475,txt!A:A,1,0)","v":"239.77.1.93:5146"}]
["#EXTINF:-1 tvg-name=\"湖北卫视\" group-title=\"IPTV-卫视\",湖北卫视高清",{"$f":"VLOOKUP(A476,txt!A:A,1,0)","v":{"$error":"#N/A"}}]
["239.77.1.174:5146",{"$f":"VLOOKUP(A477,txt!A:A,1,0)","v":"239.77.1.174:5146"}]
["#EXTINF:-1 tvg-name=\"湖北卫视\" group-title=\"IPTV-卫视\",湖北卫视高清",{"$f":"VLOOKUP(A478,txt!A:A,1,0)","v":{"$error":"#N/A"}}]
["239.77.0.95:5146",{"$f":"VLOOKUP(A479,txt!A:A,1,0)","v":"239.77.0.95:5146"}]
["#EXTINF:-1 tvg-name=\"湖北卫视\" group-title=\"IPTV-卫视\",湖北卫视超清",{"$f":"VLOOKUP(A480,txt!A:A,1,0)","v":{"$error":"#N/A"}}]
["239.77.0.128:5146",{"$f":"VLOOKUP(A481,txt!A:A,1,0)","v":"239.77.0.128:5146"}]
["#EXTINF:-1 tvg-name=\"辽宁卫视\" group-title=\"IPTV-卫视\",辽宁卫视",{"$f":"VLOOKUP(A482,txt!A:A,1,0)","v":{"$error":"#N/A"}}]
["239.77.0.57:5146",{"$f":"VLOOKUP(A483,txt!A:A,1,0)","v":{"$error":"#N/A"}}]
["#EXTINF:-1 tvg-name=\"辽宁卫视\" group-title=\"IPTV-卫视\",辽宁卫视高清",{"$f":"VLOOKUP(A484,txt!A:A,1,0)","v":{"$error":"#N/A"}}]
["239.77.1.103:5146",{"$f":"VLOOKUP(A485,txt!A:A,1,0)","v":"239.77.1.103:5146"}]
["#EXTINF:-1 tvg-name=\"辽宁卫视\" group-title=\"IPTV-卫视\",辽宁卫视 高清",{"$f":"VLOOKUP(A486,txt!A:A,1,0)","v":{"$error":"#N/A"}}]
["239.77.0.123:5146",{"$f":"VLOOKUP(A487,txt!A:A,1,0)","v":"239.77.0.123:5146"}]
["#EXTINF:-1 tvg-name=\"辽宁卫视\" group-title=\"IPTV-卫视\",辽宁卫视超清 (CAVS)",{"$f":"VLOOKUP(A488,txt!A:A,1,0)","v":{"$error":"#N/A"}}]
["239.77.0.161:5146",{"$f":"VLOOKUP(A489,txt!A:A,1,0)","v":"239.77.0.161:5146"}]
["#EXTINF:-1 tvg-name=\"黑龙江卫视\" group-title=\"IPTV-卫视\",黑龙江卫视",{"$f":"VLOOKUP(A490,txt!A:A,1,0)","v":{"$error":"#N/A"}}]
["239.77.0.58:5146",{"$f":"VLOOKUP(A491,txt!A:A,1,0)","v":{"$error":"#N/A"}}]
["#EXTINF:-1 tvg-name=\"黑龙江卫视\" group-title=\"IPTV-卫视\",黑龙江卫视高清",{"$f":"VLOOKUP(A492,txt!A:A,1,0)","v":{"$error":"#N/A"}}]
["239.77.1.6:5146",{"$f":"VLOOKUP(A493,txt!A:A,1,0)","v":"239.77.1.6:5146"}]
["#EXTINF:-1 tvg-name=\"黑龙江卫视\" group-title=\"IPTV-卫视\",黑龙江卫视高清",{"$f":"VLOOKUP(A494,txt!A:A,1,0)","v":{"$error":"#N/A"}}]
["239.77.1.179:5146",{"$f":"VLOOKUP(A495,txt!A:A,1,0)","v":"239.77.1.179:5146"}]
["#EXTINF:-1 tvg-name=\"黑龙江卫视\" group-title=\"IPTV-卫视\",黑龙江卫视高清",{"$f":"VLOOKUP(A496,txt!A:A,1,0)","v":{"$error":"#N/A"}}]
["239.77.0.93:5146",{"$f":"VLOOKUP(A497,txt!A:A,1,0)","v":"239.77.0.93:5146"}]
["#EXTINF:-1 tvg-name=\"黑龙江卫视\" group-title=\"IPTV-卫视\",黑龙江卫视超清",{"$f":"VLOOKUP(A498,txt!A:A,1,0)","v":{"$error":"#N/A"}}]
["239.77.0.124:5146",{"$f":"VLOOKUP(A499,txt!A:A,1,0)","v":"239.77.0.124:5146"}]
["#EXTINF:-1 tvg-name=\"贵州卫视\" group-title=\"IPTV-卫视\",贵州卫视",{"$f":"VLOOKUP(A500,txt!A:A,1,0)","v":{"$error":"#N/A"}}]
["239.77.0.59:5146",{"$f":"VLOOKUP(A501,txt!A:A,1,0)","v":{"$error":"#N/A"}}]
["#EXTINF:-1 tvg-name=\"贵州卫视\" group-title=\"IPTV-卫视\",贵州卫视高清",{"$f":"VLOOKUP(A502,txt!A:A,1,0)","v":{"$error":"#N/A"}}]
["239.77.1.221:5146",{"$f":"VLOOKUP(A503,txt!A:A,1,0)","v":"239.77.1.221:5146"}]
["#EXTINF:-1 tvg-name=\"贵州卫视\" group-title=\"IPTV-卫视\",贵州卫视高清",{"$f":"VLOOKUP(A504,txt!A:A,1,0)","v":{"$error":"#N/A"}}]
["239.77.0.230:5146",{"$f":"VLOOKUP(A505,txt!A:A,1,0)","v":"239.77.0.230:5146"}]
["#EXTINF:-1 tvg-name=\"四川卫视\" group-title=\"IPTV-卫视\",四川卫视",{"$f":"VLOOKUP(A506,txt!A:A,1,0)","v":{"$error":"#N/A"}}]
["239.77.0.60:5146",{"$f":"VLOOKUP(A507,txt!A:A,1,0)","v":{"$error":"#N/A"}}]
["#EXTINF:-1 tvg-name=\"四川卫视\" group-title=\"IPTV-卫视\",四川卫视高清",{"$f":"VLOOKUP(A508,txt!A:A,1,0)","v":{"$error":"#N/A"}}]
["239.77.1.215:5146",{"$f":"VLOOKUP(A509,txt!A:A,1,0)","v":"239.77.1.215:5146"}]
["#EXTINF:-1 tvg-name=\"四川卫视\" group-title=\"IPTV-卫视\",四川卫视高清",{"$f":"VLOOKUP(A510,txt!A:A,1,0)","v":{"$error":"#N/A"}}]
["239.77.0.159:5146",{"$f":"VLOOKUP(A511,txt!A:A,1,0)","v":"239.77.0.159:5146"}]
["#EXTINF:-1 tvg-name=\"四川卫视\" group-title=\"IPTV-卫视\",四川卫视超清 (CAVS)",{"$f":"VLOOKUP(A512,txt!A:A,1,0)","v":{"$error":"#N/A"}}]
["239.77.0.163:5146",{"$f":"VLOOKUP(A513,txt!A:A,1,0)","v":"239.77.0.163:5146"}]
["#EXTINF:-1 tvg-name=\"河南卫视\" group-title=\"IPTV-卫视\",河南卫视",{"$f":"VLOOKUP(A514,txt!A:A,1,0)","v":{"$error":"#N/A"}}]
["239.77.0.61:5146",{"$f":"VLOOKUP(A515,txt!A:A,1,0)","v":{"$error":"#N/A"}}]
["#EXTINF:-1 tvg-name=\"河南卫视\" group-title=\"IPTV-卫视\",河南卫视高清",{"$f":"VLOOKUP(A516,txt!A:A,1,0)","v":{"$error":"#N/A"}}]
["239.77.1.229:5146",{"$f":"VLOOKUP(A517,txt!A:A,1,0)","v":"239.77.1.229:5146"}]
["#EXTINF:-1 tvg-name=\"河南卫视\" group-title=\"IPTV-卫视\",河南卫视高清",{"$f":"VLOOKUP(A518,txt!A:A,1,0)","v":{"$error":"#N/A"}}]
["239.77.0.17:5146",{"$f":"VLOOKUP(A519,txt!A:A,1,0)","v":"239.77.0.17:5146"}]
["#EXTINF:-1 tvg-name=\"云南卫视\" group-title=\"IPTV-卫视\",云南卫视",{"$f":"VLOOKUP(A520,txt!A:A,1,0)","v":{"$error":"#N/A"}}]
["239.77.0.62:5146",{"$f":"VLOOKUP(A521,txt!A:A,1,0)","v":{"$error":"#N/A"}}]
["#EXTINF:-1 tvg-name=\"云南卫视\" group-title=\"IPTV-卫视\",云南卫视高清",{"$f":"VLOOKUP(A522,txt!A:A,1,0)","v":{"$error":"#N/A"}}]
["239.253.43.37:5146",{"$f":"VLOOKUP(A523,txt!A:A,1,0)","v":"239.253.43.37:5146"}]
["#EXTINF:-1 tvg-name=\"云南卫视\" group-title=\"IPTV-卫视\",云南卫视高清",{"$f":"VLOOKUP(A524,txt!A:A,1,0)","v":{"$error":"#N/A"}}]
["239.253.43.100:5146",{"$f":"VLOOKUP(A525,txt!A:A,1,0)","v":"239.253.43.100:5146"}]
["#EXTINF:-1 tvg-name=\"重庆卫视\" group-title=\"IPTV-卫视\",重庆卫视",{"$f":"VLOOKUP(A526,txt!A:A,1,0)","v":{"$error":"#N/A"}}]
["239.77.0.63:5146",{"$f":"VLOOKUP(A527,txt!A:A,1,0)","v":{"$error":"#N/A"}}]
["#EXTINF:-1 tvg-name=\"重庆卫视\" group-title=\"IPTV-卫视\",重庆卫视高清",{"$f":"VLOOKUP(A528,txt!A:A,1,0)","v":{"$error":"#N/A"}}]
["239.77.1.162:5146",{"$f":"VLOOKUP(A529,txt!A:A,1,0)","v":"239.77.1.162:5146"}]
["#EXTINF:-1 tvg-name=\"重庆卫视\" group-title=\"IPTV-卫视\",重庆卫视高清",{"$f":"VLOOKUP(A530,txt!A:A,1,0)","v":{"$error":"#N/A"}}]
["239.77.0.182:5146",{"$f":"VLOOKUP(A531,txt!A:A,1,0)","v":"239.77.0.182:5146"}]
["#EXTINF:-1 tvg-name=\"河北卫视\" group-title=\"IPTV-卫视\",河北卫视",{"$f":"VLOOKUP(A532,txt!A:A,1,0)","v":{"$error":"#N/A"}}]
["239.77.0.64:5146",{"$f":"VLOOKUP(A533,txt!A:A,1,0)","v":{"$error":"#N/A"}}]
["#EXTINF:-1 tvg-name=\"河北卫视\" group-title=\"IPTV-卫视\",河北卫视高清",{"$f":"VLOOKUP(A534,txt!A:A,1,0)","v":{"$error":"#N/A"}}]
["239.77.1.214:5146",{"$f":"VLOOKUP(A535,txt!A:A,1,0)","v":"239.77.1.214:5146"}]
["#EXTINF:-1 tvg-name=\"河北卫视\" group-title=\"IPTV-卫视\",河北卫视高清",{"$f":"VLOOKUP(A536,txt!A:A,1,0)","v":{"$error":"#N/A"}}]
["239.77.0.148:5146",{"$f":"VLOOKUP(A537,txt!A:A,1,0)","v":"239.77.0.148:5146"}]
["#EXTINF:-1 tvg-name=\"东南卫视\" group-title=\"IPTV-卫视\",东南卫视",{"$f":"VLOOKUP(A538,txt!A:A,1,0)","v":{"$error":"#N/A"}}]
["239.77.0.65:5146",{"$f":"VLOOKUP(A539,txt!A:A,1,0)","v":{"$error":"#N/A"}}]
["#EXTINF:-1 tvg-name=\"东南卫视\" group-title=\"IPTV-卫视\",东南卫视高清",{"$f":"VLOOKUP(A540,txt!A:A,1,0)","v":{"$error":"#N/A"}}]
["239.77.1.104:5146",{"$f":"VLOOKUP(A541,txt!A:A,1,0)","v":"239.77.1.104:5146"}]
["#EXTINF:-1 tvg-name=\"东南卫视\" group-title=\"IPTV-卫视\",福建东南卫视高清",{"$f":"VLOOKUP(A542,txt!A:A,1,0)","v":{"$error":"#N/A"}}]
["239.77.0.146:5146",{"$f":"VLOOKUP(A543,txt!A:A,1,0)","v":"239.77.0.146:5146"}]
["#EXTINF:-1 tvg-name=\"广西卫视\" group-title=\"IPTV-卫视\",广西卫视",{"$f":"VLOOKUP(A544,txt!A:A,1,0)","v":{"$error":"#N/A"}}]
["239.77.0.66:5146",{"$f":"VLOOKUP(A545,txt!A:A,1,0)","v":{"$error":"#N/A"}}]
["#EXTINF:-1 tvg-name=\"广西卫视\" group-title=\"IPTV-卫视\",广西卫视高清",{"$f":"VLOOKUP(A546,txt!A:A,1,0)","v":{"$error":"#N/A"}}]
["239.253.43.36:5146",{"$f":"VLOOKUP(A547,txt!A:A,1,0)","v":"239.253.43.36:5146"}]
["#EXTINF:-1 tvg-name=\"广西卫视\" group-title=\"IPTV-卫视\",广西卫视高清",{"$f":"VLOOKUP(A548,txt!A:A,1,0)","v":{"$error":"#N/A"}}]
["239.77.0.139:5146",{"$f":"VLOOKUP(A549,txt!A:A,1,0)","v":"239.77.0.139:5146"}]
["#EXTINF:-1 tvg-name=\"吉林卫视\" group-title=\"IPTV-卫视\",吉林卫视",{"$f":"VLOOKUP(A550,txt!A:A,1,0)","v":{"$error":"#N/A"}}]
["239.77.0.67:5146",{"$f":"VLOOKUP(A551,txt!A:A,1,0)","v":{"$error":"#N/A"}}]
["#EXTINF:-1 tvg-name=\"吉林卫视\" group-title=\"IPTV-卫视\",吉林卫视高清",{"$f":"VLOOKUP(A552,txt!A:A,1,0)","v":{"$error":"#N/A"}}]
["239.77.1.111:5146",{"$f":"VLOOKUP(A553,txt!A:A,1,0)","v":"239.77.1.111:5146"}]
["#EXTINF:-1 tvg-name=\"吉林卫视\" group-title=\"IPTV-卫视\",吉林卫视高清",{"$f":"VLOOKUP(A554,txt!A:A,1,0)","v":{"$error":"#N/A"}}]
["239.77.0.150:5146",{"$f":"VLOOKUP(A555,txt!A:A,1,0)","v":"239.77.0.150:5146"}]
["#EXTINF:-1 tvg-name=\"陕西卫视\" group-title=\"IPTV-卫视\",陕西卫视",{"$f":"VLOOKUP(A556,txt!A:A,1,0)","v":{"$error":"#N/A"}}]
["239.77.0.68:5146",{"$f":"VLOOKUP(A557,txt!A:A,1,0)","v":"239.77.0.68:5146"}]
["#EXTINF:-1 tvg-name=\"陕西卫视\" group-title=\"IPTV-卫视\",陕西卫视",{"$f":"VLOOKUP(A558,txt!A:A,1,0)","v":{"$error":"#N/A"}}]
["239.77.1.54:5146",{"$f":"VLOOKUP(A559,txt!A:A,1,0)","v":"239.77.1.54:5146"}]
["#EXTINF:-1 tvg-name=\"山西卫视\" group-title=\"IPTV-卫视\",山西卫视",{"$f":"VLOOKUP(A560,txt!A:A,1,0)","v":{"$error":"#N/A"}}]
["239.77.0.69:5146",{"$f":"VLOOKUP(A561,txt!A:A,1,0)","v":"239.77.0.69:5146"}]
["#EXTINF:-1 tvg-name=\"山西卫视\" group-title=\"IPTV-卫视\",山西卫视",{"$f":"VLOOKUP(A562,txt!A:A,1,0)","v":{"$error":"#N/A"}}]
["239.77.1.74:5146",{"$f":"VLOOKUP(A563,txt!A:A,1,0)","v":"239.77.1.74:5146"}]
["#EXTINF:-1 tvg-name=\"内蒙古卫视\" group-title=\"IPTV-卫视\",内蒙古卫视",{"$f":"VLOOKUP(A564,txt!A:A,1,0)","v":{"$error":"#N/A"}}]
["239.77.0.70:5146",{"$f":"VLOOKUP(A565,txt!A:A,1,0)","v":"239.77.0.70:5146"}]
["#EXTINF:-1 tvg-name=\"内蒙古卫视\" group-title=\"IPTV-卫视\",内蒙古卫视",{"$f":"VLOOKUP(A566,txt!A:A,1,0)","v":{"$error":"#N/A"}}]
["239.77.1.55:5146",{"$f":"VLOOKUP(A567,txt!A:A,1,0)","v":"239.77.1.55:5146"}]
["#EXTINF:-1 tvg-name=\"青海卫视\" group-title=\"IPTV-卫视\",青海卫视",{"$f":"VLOOKUP(A568,txt!A:A,1,0)","v":{"$error":"#N/A"}}]
["239.77.0.71:5146",{"$f":"VLOOKUP(A569,txt!A:A,1,0)","v":{"$error":"#N/A"}}]
["#EXTINF:-1 tvg-name=\"青海卫视\" group-title=\"IPTV-卫视\",青海卫视",{"$f":"VLOOKUP(A570,txt!A:A,1,0)","v":{"$error":"#N/A"}}]
["239.77.1.70:5146",{"$f":"VLOOKUP(A571,txt!A:A,1,0)","v":"239.77.1.70:5146"}]
["#EXTINF:-1 tvg-name=\"青海卫视\" group-title=\"IPTV-卫视\",青海卫视高清",{"$f":"VLOOKUP(A572,txt!A:A,1,0)","v":{"$error":"#N/A"}}]
["239.253.43.125:5146",{"$f":"VLOOKUP(A573,txt!A:A,1,0)","v":"239.253.43.125:5146"}]
["#EXTINF:-1 tvg-name=\"海南卫视\" group-title=\"IPTV-卫视\",海南卫视",{"$f":"VLOOKUP(A574,txt!A:A,1,0)","v":{"$error":"#N/A"}}]
["239.77.0.72:5146",{"$f":"VLOOKUP(A575,txt!A:A,1,0)","v":{"$error":"#N/A"}}]
["#EXTINF:-1 tvg-name=\"海南卫视\" group-title=\"IPTV-卫视\",海南卫视高清",{"$f":"VLOOKUP(A576,txt!A:A,1,0)","v":{"$error":"#N/A"}}]
["239.253.43.35:5146",{"$f":"VLOOKUP(A577,txt!A:A,1,0)","v":"239.253.43.35:5146"}]
["#EXTINF:-1 tvg-name=\"海南卫视\" group-title=\"IPTV-卫视\",海南卫视高清",{"$f":"VLOOKUP(A578,txt!A:A,1,0)","v":{"$error":"#N/A"}}]
["239.253.43.101:5146",{"$f":"VLOOKUP(A579,txt!A:A,1,0)","v":"239.253.43.101:5146"}]
["#EXTINF:-1 tvg-name=\"宁夏卫视\" group-title=\"IPTV-卫视\",宁夏卫视",{"$f":"VLOOKUP(A580,txt!A:A,1,0)","v":{"$error":"#N/A"}}]
["239.77.0.73:5146",{"$f":"VLOOKUP(A581,txt!A:A,1,0)","v":"239.77.0.73:5146"}]
["#EXTINF:-1 tvg-name=\"宁夏卫视\" group-title=\"IPTV-卫视\",宁夏卫视",{"$f":"VLOOKUP(A582,txt!A:A,1,0)","v":{"$error":"#N/A"}}]
["239.77.1.47:5146",{"$f":"VLOOKUP(A583,txt!A:A,1,0)","v":"239.77.1.47:5146"}]
["#EXTINF:-1 tvg-name=\"西藏卫视\" group-title=\"IPTV-卫视\",西藏卫视",{"$f":"VLOOKUP(A584,txt!A:A,1,0)","v":{"$error":"#N/A"}}]
["239.77.0.74:5146",{"$f":"VLOOKUP(A585,txt!A:A,1,0)","v":"239.77.0.74:5146"}]
["#EXTINF:-1 tvg-name=\"西藏卫视\" group-title=\"IPTV-卫视\",西藏卫视",{"$f":"VLOOKUP(A586,txt!A:A,1,0)","v":{"$error":"#N/A"}}]
["239.77.1.49:5146",{"$f":"VLOOKUP(A587,txt!A:A,1,0)","v":"239.77.1.49:5146"}]
["#EXTINF:-1 tvg-name=\"新疆卫视\" group-title=\"IPTV-卫视\",新疆卫视",{"$f":"VLOOKUP(A588,txt!A:A,1,0)","v":{"$error":"#N/A"}}]
["239.77.0.75:5146",{"$f":"VLOOKUP(A589,txt!A:A,1,0)","v":"239.77.0.75:5146"}]
["#EXTINF:-1 tvg-name=\"新疆卫视\" group-title=\"IPTV-卫视\",新疆卫视",{"$f":"VLOOKUP(A590,txt!A:A,1,0)","v":{"$error":"#N/A"}}]
["239.77.1.53:5146",{"$f":"VLOOKUP(A591,txt!A:A,1,0)","v":"239.77.1.53:5146"}]
["#EXTINF:-1 tvg-name=\"甘肃卫视\" group-title=\"IPTV-卫视\",甘肃卫视",{"$f":"VLOOKUP(A592,txt!A:A,1,0)","v":{"$error":"#N/A"}}]
["239.77.0.76:5146",{"$f":"VLOOKUP(A593,txt!A:A,1,0)","v":{"$error":"#N/A"}}]
["#EXTINF:-1 tvg-name=\"甘肃卫视\" group-title=\"IPTV-卫视\",甘肃卫视",{"$f":"VLOOKUP(A594,txt!A:A,1,0)","v":{"$error":"#N/A"}}]
["239.77.1.57:5146",{"$f":"VLOOKUP(A595,txt!A:A,1,0)","v":"239.77.1.57:5146"}]
["#EXTINF:-1 tvg-name=\"甘肃卫视\" group-title=\"IPTV-卫视\",甘肃卫视高清",{"$f":"VLOOKUP(A596,txt!A:A,1,0)","v":{"$error":"#N/A"}}]
["239.77.0.189:5146",{"$f":"VLOOKUP(A597,txt!A:A,1,0)","v":"239.77.0.189:5146"}]
["#EXTINF:-1 tvg-name=\"兵团卫视\" group-title=\"IPTV-卫视\",兵团卫视",{"$f":"VLOOKUP(A598,txt!A:A,1,0)","v":{"$error":"#N/A"}}]
["239.77.0.77:5146",{"$f":"VLOOKUP(A599,txt!A:A,1,0)","v":"239.77.0.77:5146"}]
["#EXTINF:-1 tvg-name=\"兵团卫视\" group-title=\"IPTV-卫视\",兵团卫视",{"$f":"VLOOKUP(A600,txt!A:A,1,0)","v":{"$error":"#N/A"}}]
["239.77.1.80:5146",{"$f":"VLOOKUP(A601,txt!A:A,1,0)","v":"239.77.1.80:5146"}]
["#EXTINF:-1 tvg-name=\"厦门卫视\" group-title=\"IPTV-卫视\",厦门卫视",{"$f":"VLOOKUP(A602,txt!A:A,1,0)","v":{"$error":"#N/A"}}]
["239.77.0.96:5146",{"$f":"VLOOKUP(A603,txt!A:A,1,0)","v":"239.77.0.96:5146"}]
["#EXTINF:-1 tvg-name=\"三沙卫视\" group-title=\"IPTV-卫视\",三沙卫视",{"$f":"VLOOKUP(A604,txt!A:A,1,0)","v":{"$error":"#N/A"}}]
["239.77.0.152:5146",{"$f":"VLOOKUP(A605,txt!A:A,1,0)","v":{"$error":"#N/A"}}]
["#EXTINF:-1 tvg-name=\"三沙卫视\" group-title=\"IPTV-卫视\",三沙卫视",{"$f":"VLOOKUP(A606,txt!A:A,1,0)","v":{"$error":"#N/A"}}]
["239.77.1.117:5146",{"$f":"VLOOKUP(A607,txt!A:A,1,0)","v":"239.77.1.117:5146"}]
["#EXTINF:-1 tvg-name=\"三沙卫视\" group-title=\"IPTV-卫视\",三沙卫视高清",{"$f":"VLOOKUP(A608,txt!A:A,1,0)","v":{"$error":"#N/A"}}]
["239.253.43.113:5146",{"$f":"VLOOKUP(A609,txt!A:A,1,0)","v":"239.253.43.113:5146"}]
["#EXTINF:-1 tvg-name=\"延边卫视\" group-title=\"IPTV-卫视\",吉林延边卫视",{"$f":"VLOOKUP(A610,txt!A:A,1,0)","v":{"$error":"#N/A"}}]
["239.77.0.10:5146",{"$f":"VLOOKUP(A611,txt!A:A,1,0)","v":"239.77.0.10:5146"}]
["#EXTINF:-1 tvg-name=\"延边卫视\" group-title=\"IPTV-卫视\",延边卫视",{"$f":"VLOOKUP(A612,txt!A:A,1,0)","v":{"$error":"#N/A"}}]
["239.77.1.99:5146",{"$f":"VLOOKUP(A613,txt!A:A,1,0)","v":"239.77.1.99:5146"}]
["#EXTINF:-1 tvg-name=\"兵器科技\" group-title=\"IPTV-央视网台\",兵器科技高清",{"$f":"VLOOKUP(A614,txt!A:A,1,0)","v":{"$error":"#N/A"}}]
["239.253.43.18:5146",{"$f":"VLOOKUP(A615,txt!A:A,1,0)","v":"239.253.43.18:5146"}]
["#EXTINF:-1 tvg-name=\"兵器科技\" group-title=\"IPTV-央视网台\",兵器科技高清",{"$f":"VLOOKUP(A616,txt!A:A,1,0)","v":{"$error":"#N/A"}}]
["239.253.43.9:5146",{"$f":"VLOOKUP(A617,txt!A:A,1,0)","v":"239.253.43.9:5146"}]
["#EXTINF:-1 tvg-name=\"电视指南\" group-title=\"IPTV-央视网台\",电视指南高清",{"$f":"VLOOKUP(A618,txt!A:A,1,0)","v":{"$error":"#N/A"}}]
["239.253.43.19:5146",{"$f":"VLOOKUP(A619,txt!A:A,1,0)","v":"239.253.43.19:5146"}]
["#EXTINF:-1 tvg-name=\"电视指南\" group-title=\"IPTV-央视网台\",电视指南高清",{"$f":"VLOOKUP(A620,txt!A:A,1,0)","v":{"$error":"#N/A"}}]
["239.253.43.10:5146",{"$f":"VLOOKUP(A621,txt!A:A,1,0)","v":"239.253.43.10:5146"}]
["#EXTINF:-1 tvg-name=\"风云足球\" group-title=\"IPTV-央视网台\",风云足球高清",{"$f":"VLOOKUP(A622,txt!A:A,1,0)","v":{"$error":"#N/A"}}]
["239.253.43.20:5146",{"$f":"VLOOKUP(A623,txt!A:A,1,0)","v":"239.253.43.20:5146"}]
["#EXTINF:-1 tvg-name=\"风云足球\" group-title=\"IPTV-央视网台\",风云足球高清",{"$f":"VLOOKUP(A624,txt!A:A,1,0)","v":{"$error":"#N/A"}}]
["239.253.43.14:5146",{"$f":"VLOOKUP(A625,txt!A:A,1,0)","v":"239.253.43.14:5146"}]
["#EXTINF:-1 tvg-name=\"央视台球\" group-title=\"IPTV-央视网台\",央视台球高清",{"$f":"VLOOKUP(A626,txt!A:A,1,0)","v":{"$error":"#N/A"}}]
["239.253.43.21:5146",{"$f":"VLOOKUP(A627,txt!A:A,1,0)","v":"239.253.43.21:5146"}]
["#EXTINF:-1 tvg-name=\"央视台球\" group-title=\"IPTV-央视网台\",央视台球高清",{"$f":"VLOOKUP(A628,txt!A:A,1,0)","v":{"$error":"#N/A"}}]
["239.253.43.11:5146",{"$f":"VLOOKUP(A629,txt!A:A,1,0)","v":"239.253.43.11:5146"}]
["#EXTINF:-1 tvg-name=\"高尔夫网球\" group-title=\"IPTV-央视网台\",高尔夫网球高清",{"$f":"VLOOKUP(A630,txt!A:A,1,0)","v":{"$error":"#N/A"}}]
["239.253.43.22:5146",{"$f":"VLOOKUP(A631,txt!A:A,1,0)","v":"239.253.43.22:5146"}]
["#EXTINF:-1 tvg-name=\"高尔夫网球\" group-title=\"IPTV-央视网台\",高尔夫网球高清",{"$f":"VLOOKUP(A632,txt!A:A,1,0)","v":{"$error":"#N/A"}}]
["239.253.43.12:5146",{"$f":"VLOOKUP(A633,txt!A:A,1,0)","v":"239.253.43.12:5146"}]
["#EXTINF:-1 tvg-name=\"女性时尚\" group-title=\"IPTV-央视网台\",女性时尚高清",{"$f":"VLOOKUP(A634,txt!A:A,1,0)","v":{"$error":"#N/A"}}]
["239.253.43.23:5146",{"$f":"VLOOKUP(A635,txt!A:A,1,0)","v":"239.253.43.23:5146"}]
["#EXTINF:-1 tvg-name=\"女性时尚\" group-title=\"IPTV-央视网台\",女性时尚高清",{"$f":"VLOOKUP(A636,txt!A:A,1,0)","v":{"$error":"#N/A"}}]
["239.253.43.8:5146",{"$f":"VLOOKUP(A637,txt!A:A,1,0)","v":"239.253.43.8:5146"}]
["#EXTINF:-1 tvg-name=\"世界地理\" group-title=\"IPTV-央视网台\",世界地理高清",{"$f":"VLOOKUP(A638,txt!A:A,1,0)","v":{"$error":"#N/A"}}]
["239.253.43.24:5146",{"$f":"VLOOKUP(A639,txt!A:A,1,0)","v":"239.253.43.24:5146"}]
["#EXTINF:-1 tvg-name=\"世界地理\" group-title=\"IPTV-央视网台\",世界地理高清",{"$f":"VLOOKUP(A640,txt!A:A,1,0)","v":{"$error":"#N/A"}}]
["239.253.43.7:5146",{"$f":"VLOOKUP(A641,txt!A:A,1,0)","v":"239.253.43.7:5146"}]
["#EXTINF:-1 tvg-name=\"怀旧剧场\" group-title=\"IPTV-央视网台\",怀旧剧场高清",{"$f":"VLOOKUP(A642,txt!A:A,1,0)","v":{"$error":"#N/A"}}]
["239.253.43.25:5146",{"$f":"VLOOKUP(A643,txt!A:A,1,0)","v":"239.253.43.25:5146"}]
["#EXTINF:-1 tvg-name=\"怀旧剧场\" group-title=\"IPTV-央视网台\",怀旧剧场高清",{"$f":"VLOOKUP(A644,txt!A:A,1,0)","v":{"$error":"#N/A"}}]
["239.253.43.5:5146",{"$f":"VLOOKUP(A645,txt!A:A,1,0)","v":"239.253.43.5:5146"}]
["#EXTINF:-1 tvg-name=\"风云剧场\" group-title=\"IPTV-央视网台\",风云剧场高清",{"$f":"VLOOKUP(A646,txt!A:A,1,0)","v":{"$error":"#N/A"}}]
["239.253.43.26:5146",{"$f":"VLOOKUP(A647,txt!A:A,1,0)","v":"239.253.43.26:5146"}]
["#EXTINF:-1 tvg-name=\"风云剧场\" group-title=\"IPTV-央视网台\",风云剧场高清",{"$f":"VLOOKUP(A648,txt!A:A,1,0)","v":{"$error":"#N/A"}}]
["239.253.43.16:5146",{"$f":"VLOOKUP(A649,txt!A:A,1,0)","v":"239.253.43.16:5146"}]
["#EXTINF:-1 tvg-name=\"央视文化精品\" group-title=\"IPTV-央视网台\",央视文化精品高清",{"$f":"VLOOKUP(A650,txt!A:A,1,0)","v":{"$error":"#N/A"}}]
["239.253.43.27:5146",{"$f":"VLOOKUP(A651,txt!A:A,1,0)","v":"239.253.43.27:5146"}]
["#EXTINF:-1 tvg-name=\"央视文化精品\" group-title=\"IPTV-央视网台\",央视文化精品高清",{"$f":"VLOOKUP(A652,txt!A:A,1,0)","v":{"$error":"#N/A"}}]
["239.253.43.13:5146",{"$f":"VLOOKUP(A653,txt!A:A,1,0)","v":"239.253.43.13:5146"}]
["#EXTINF:-1 tvg-name=\"第一剧场\" group-title=\"IPTV-央视网台\",第一剧场高清",{"$f":"VLOOKUP(A654,txt!A:A,1,0)","v":{"$error":"#N/A"}}]
["239.253.43.28:5146",{"$f":"VLOOKUP(A655,txt!A:A,1,0)","v":"239.253.43.28:5146"}]
["#EXTINF:-1 tvg-name=\"第一剧场\" group-title=\"IPTV-央视网台\",第一剧场高清",{"$f":"VLOOKUP(A656,txt!A:A,1,0)","v":{"$error":"#N/A"}}]
["239.253.43.15:5146",{"$f":"VLOOKUP(A657,txt!A:A,1,0)","v":"239.253.43.15:5146"}]
["#EXTINF:-1 tvg-name=\"风云音乐\" group-title=\"IPTV-央视网台\",风云音乐高清",{"$f":"VLOOKUP(A658,txt!A:A,1,0)","v":{"$error":"#N/A"}}]
["239.253.43.29:5146",{"$f":"VLOOKUP(A659,txt!A:A,1,0)","v":"239.253.43.29:5146"}]
["#EXTINF:-1 tvg-name=\"风云音乐\" group-title=\"IPTV-央视网台\",风云音乐高清",{"$f":"VLOOKUP(A660,txt!A:A,1,0)","v":{"$error":"#N/A"}}]
["239.253.43.6:5146",{"$f":"VLOOKUP(A661,txt!A:A,1,0)","v":"239.253.43.6:5146"}]
["#EXTINF:-1 tvg-name=\"卫生健康\" group-title=\"IPTV-央视网台\",卫生健康高清",{"$f":"VLOOKUP(A662,txt!A:A,1,0)","v":{"$error":"#N/A"}}]
["239.77.0.212:5146",{"$f":"VLOOKUP(A663,txt!A:A,1,0)","v":"239.77.0.212:5146"}]
["#EXTINF:-1 tvg-name=\"老故事\" group-title=\"IPTV-央视网台\",老故事",{"$f":"VLOOKUP(A664,txt!A:A,1,0)","v":{"$error":"#N/A"}}]
["239.77.0.220:5146",{"$f":"VLOOKUP(A665,txt!A:A,1,0)","v":"239.77.0.220:5146"}]
["#EXTINF:-1 tvg-name=\"老故事\" group-title=\"IPTV-央视网台\",老故事",{"$f":"VLOOKUP(A666,txt!A:A,1,0)","v":{"$error":"#N/A"}}]
["239.77.1.197:5146",{"$f":"VLOOKUP(A667,txt!A:A,1,0)","v":"239.77.1.197:5146"}]
["#EXTINF:-1 tvg-name=\"中学生\" group-title=\"IPTV-央视网台\",中学生",{"$f":"VLOOKUP(A668,txt!A:A,1,0)","v":{"$error":"#N/A"}}]
["239.77.1.195:5146",{"$f":"VLOOKUP(A669,txt!A:A,1,0)","v":"239.77.1.195:5146"}]
["#EXTINF:-1 tvg-name=\"发现之旅\" group-title=\"IPTV-央视网台\",发现之旅",{"$f":"VLOOKUP(A670,txt!A:A,1,0)","v":{"$error":"#N/A"}}]
["239.77.1.112:5146",{"$f":"VLOOKUP(A671,txt!A:A,1,0)","v":"239.77.1.112:5146"}]
["#EXTINF:-1 tvg-name=\"发现之旅\" group-title=\"IPTV-央视网台\",发现之旅",{"$f":"VLOOKUP(A672,txt!A:A,1,0)","v":{"$error":"#N/A"}}]
["239.253.43.127:5146",{"$f":"VLOOKUP(A673,txt!A:A,1,0)","v":"239.253.43.127:5146"}]
["#EXTINF:-1 tvg-name=\"CHC影迷电影\" group-title=\"IPTV-央视网台\",CHC影迷电影高清",{"$f":"VLOOKUP(A674,txt!A:A,1,0)","v":{"$error":"#N/A"}}]
["239.77.0.27:5146",{"$f":"VLOOKUP(A675,txt!A:A,1,0)","v":{"$error":"#N/A"}}]
["#EXTINF:-1 tvg-name=\"卡酷少儿\" group-title=\"IPTV-数字付费\",卡酷少儿",{"$f":"VLOOKUP(A676,txt!A:A,1,0)","v":{"$error":"#N/A"}}]
["239.77.0.79:5146",{"$f":"VLOOKUP(A677,txt!A:A,1,0)","v":"239.77.0.79:5146"}]
["#EXTINF:-1 tvg-name=\"卡酷少儿\" group-title=\"IPTV-数字付费\",卡酷少儿",{"$f":"VLOOKUP(A678,txt!A:A,1,0)","v":{"$error":"#N/A"}}]
["239.77.1.50:5146",{"$f":"VLOOKUP(A679,txt!A:A,1,0)","v":"239.77.1.50:5146"}]
["#EXTINF:-1 tvg-name=\"金鹰卡通\" group-title=\"IPTV-数字付费\",金鹰卡通",{"$f":"VLOOKUP(A680,txt!A:A,1,0)","v":{"$error":"#N/A"}}]
["239.77.0.80:5146",{"$f":"VLOOKUP(A681,txt!A:A,1,0)","v":{"$error":"#N/A"}}]
["#EXTINF:-1 tvg-name=\"金鹰卡通\" group-title=\"IPTV-数字付费\",金鹰卡通",{"$f":"VLOOKUP(A682,txt!A:A,1,0)","v":{"$error":"#N/A"}}]
["239.77.1.52:5146",{"$f":"VLOOKUP(A683,txt!A:A,1,0)","v":"239.77.1.52:5146"}]
["#EXTINF:-1 tvg-name=\"金鹰卡通\" group-title=\"IPTV-数字付费\",金鹰卡通高清",{"$f":"VLOOKUP(A684,txt!A:A,1,0)","v":{"$error":"#N/A"}}]
["239.77.0.164:5146",{"$f":"VLOOKUP(A685,txt!A:A,1,0)","v":"239.77.0.164:5146"}]
["#EXTINF:-1 tvg-name=\"哈哈炫动\" group-title=\"IPTV-数字付费\",哈哈炫动",{"$f":"VLOOKUP(A686,txt!A:A,1,0)","v":{"$error":"#N/A"}}]
["239.77.0.81:5146",{"$f":"VLOOKUP(A687,txt!A:A,1,0)","v":"239.77.0.81:5146"}]
["#EXTINF:-1 tvg-name=\"哈哈炫动\" group-title=\"IPTV-数字付费\",哈哈炫动",{"$f":"VLOOKUP(A688,txt!A:A,1,0)","v":{"$error":"#N/A"}}]
["239.77.1.139:5146",{"$f":"VLOOKUP(A689,txt!A:A,1,0)","v":"239.77.1.139:5146"}]
["#EXTINF:-1 tvg-name=\"优漫卡通\" group-title=\"IPTV-数字付费\",优漫卡通",{"$f":"VLOOKUP(A690,txt!A:A,1,0)","v":{"$error":"#N/A"}}]
["239.77.0.222:5146",{"$f":"VLOOKUP(A691,txt!A:A,1,0)","v":"239.77.0.222:5146"}]
["#EXTINF:-1 tvg-name=\"优漫卡通\" group-title=\"IPTV-数字付费\",优漫卡通",{"$f":"VLOOKUP(A692,txt!A:A,1,0)","v":{"$error":"#N/A"}}]
["239.77.1.79:5146",{"$f":"VLOOKUP(A693,txt!A:A,1,0)","v":"239.77.1.79:5146"}]
["#EXTINF:-1 tvg-name=\"CETV-1\" group-title=\"IPTV-数字付费\",CETV-1",{"$f":"VLOOKUP(A694,txt!A:A,1,0)","v":{"$error":"#N/A"}}]
["239.77.0.82:5146",{"$f":"VLOOKUP(A695,txt!A:A,1,0)","v":{"$error":"#N/A"}}]
["#EXTINF:-1 tvg-name=\"CETV-1\" group-title=\"IPTV-数字付费\",CETV-1高清",{"$f":"VLOOKUP(A696,txt!A:A,1,0)","v":{"$error":"#N/A"}}]
["239.77.1.222:5146",{"$f":"VLOOKUP(A697,txt!A:A,1,0)","v":"239.77.1.222:5146"}]
["#EXTINF:-1 tvg-name=\"中国教育-1\" group-title=\"IPTV-数字付费\",中国教育-1高清",{"$f":"VLOOKUP(A698,txt!A:A,1,0)","v":{"$error":"#N/A"}}]
["239.77.0.200:5146",{"$f":"VLOOKUP(A699,txt!A:A,1,0)","v":"239.77.0.200:5146"}]
["#EXTINF:-1 tvg-name=\"CETV-2\" group-title=\"IPTV-数字付费\",CETV-2",{"$f":"VLOOKUP(A700,txt!A:A,1,0)","v":{"$error":"#N/A"}}]
["239.77.0.28:5146",{"$f":"VLOOKUP(A701,txt!A:A,1,0)","v":"239.77.0.28:5146"}]
["#EXTINF:-1 tvg-name=\"CETV-2\" group-title=\"IPTV-数字付费\",CETV-2",{"$f":"VLOOKUP(A702,txt!A:A,1,0)","v":{"$error":"#N/A"}}]
["239.77.1.69:5146",{"$f":"VLOOKUP(A703,txt!A:A,1,0)","v":"239.77.1.69:5146"}]
["#EXTINF:-1 tvg-name=\"CETV-4\" group-title=\"IPTV-数字付费\",CETV-4",{"$f":"VLOOKUP(A704,txt!A:A,1,0)","v":{"$error":"#N/A"}}]
["239.77.0.29:5146",{"$f":"VLOOKUP(A705,txt!A:A,1,0)","v":{"$error":"#N/A"}}]
["#EXTINF:-1 tvg-name=\"CETV-4\" group-title=\"IPTV-数字付费\",CETV-4高清",{"$f":"VLOOKUP(A706,txt!A:A,1,0)","v":{"$error":"#N/A"}}]
["239.253.43.40:5146",{"$f":"VLOOKUP(A707,txt!A:A,1,0)","v":"239.253.43.40:5146"}]
["#EXTINF:-1 tvg-name=\"CETV-4\" group-title=\"IPTV-数字付费\",CETV-4高清",{"$f":"VLOOKUP(A708,txt!A:A,1,0)","v":{"$error":"#N/A"}}]
["239.253.43.114:5146",{"$f":"VLOOKUP(A709,txt!A:A,1,0)","v":"239.253.43.114:5146"}]
["#EXTINF:-1 tvg-name=\"早期教育\" group-title=\"IPTV-数字付费\",早期教育高清",{"$f":"VLOOKUP(A710,txt!A:A,1,0)","v":{"$error":"#N/A"}}]
["239.77.1.122:5146",{"$f":"VLOOKUP(A711,txt!A:A,1,0)","v":"239.77.1.122:5146"}]
["#EXTINF:-1 tvg-name=\"早期教育\" group-title=\"IPTV-数字付费\",早期教育高清",{"$f":"VLOOKUP(A712,txt!A:A,1,0)","v":{"$error":"#N/A"}}]
["239.77.0.180:5146",{"$f":"VLOOKUP(A713,txt!A:A,1,0)","v":"239.77.0.180:5146"}]
["#EXTINF:-1 tvg-name=\"早期教育\" group-title=\"IPTV-数字付费\",早期教育高清",{"$f":"VLOOKUP(A714,txt!A:A,1,0)","v":{"$error":"#N/A"}}]
["239.77.1.114:5146",{"$f":"VLOOKUP(A715,txt!A:A,1,0)","v":"239.77.1.114:5146"}]
["#EXTINF:-1 tvg-name=\"山东教育\" group-title=\"IPTV-数字付费\",山东教育",{"$f":"VLOOKUP(A716,txt!A:A,1,0)","v":{"$error":"#N/A"}}]
["239.77.0.83:5146",{"$f":"VLOOKUP(A717,txt!A:A,1,0)","v":"239.77.0.83:5146"}]
["#EXTINF:-1 tvg-name=\"山东教育\" group-title=\"IPTV-数字付费\",山东教育卫视",{"$f":"VLOOKUP(A718,txt!A:A,1,0)","v":{"$error":"#N/A"}}]
["239.77.1.35:5146",{"$f":"VLOOKUP(A719,txt!A:A,1,0)","v":"239.77.1.35:5146"}]
["#EXTINF:-1 tvg-name=\"财富天下\" group-title=\"IPTV-数字付费\",财富天下",{"$f":"VLOOKUP(A720,txt!A:A,1,0)","v":{"$error":"#N/A"}}]
["239.77.0.113:5146",{"$f":"VLOOKUP(A721,txt!A:A,1,0)","v":"239.77.0.113:5146"}]
["#EXTINF:-1 tvg-name=\"中国交通\" group-title=\"IPTV-数字付费\",中国交通",{"$f":"VLOOKUP(A722,txt!A:A,1,0)","v":{"$error":"#N/A"}}]
["239.77.1.249:5146",{"$f":"VLOOKUP(A723,txt!A:A,1,0)","v":{"$error":"#N/A"}}]
["#EXTINF:-1 tvg-name=\"中国天气\" group-title=\"IPTV-数字付费\",中国天气",{"$f":"VLOOKUP(A724,txt!A:A,1,0)","v":{"$error":"#N/A"}}]
["239.77.1.143:5146",{"$f":"VLOOKUP(A725,txt!A:A,1,0)","v":{"$error":"#N/A"}}]
["#EXTINF:-1 tvg-name=\"中国天气\" group-title=\"IPTV-数字付费\",中国天气高清",{"$f":"VLOOKUP(A726,txt!A:A,1,0)","v":{"$error":"#N/A"}}]
["239.77.1.2:5146",{"$f":"VLOOKUP(A727,txt!A:A,1,0)","v":"239.77.1.2:5146"}]
["#EXTINF:-1 tvg-name=\"茶\" group-title=\"IPTV-数字付费\",茶",{"$f":"VLOOKUP(A728,txt!A:A,1,0)","v":{"$error":"#N/A"}}]
["239.77.0.15:5146",{"$f":"VLOOKUP(A729,txt!A:A,1,0)","v":"239.77.0.15:5146"}]
["#EXTINF:-1 tvg-name=\"快乐垂钓\" group-title=\"IPTV-数字付费\",快乐垂钓",{"$f":"VLOOKUP(A730,txt!A:A,1,0)","v":{"$error":"#N/A"}}]
["239.77.0.145:5146",{"$f":"VLOOKUP(A731,txt!A:A,1,0)","v":"239.77.0.145:5146"}]
["#EXTINF:-1 tvg-name=\"快乐垂钓\" group-title=\"IPTV-数字付费\",快乐垂钓高清",{"$f":"VLOOKUP(A732,txt!A:A,1,0)","v":{"$error":"#N/A"}}]
["239.77.1.119:5146",{"$f":"VLOOKUP(A733,txt!A:A,1,0)","v":{"$error":"#N/A"}}]
["#EXTINF:-1 tvg-name=\"冬奥纪实\" group-title=\"IPTV-数字付费\",冬奥纪实高清",{"$f":"VLOOKUP(A734,txt!A:A,1,0)","v":{"$error":"#N/A"}}]
["239.77.1.110:5146",{"$f":"VLOOKUP(A735,txt!A:A,1,0)","v":{"$error":"#N/A"}}]
["#EXTINF:-1 tvg-name=\"金鹰纪实\" group-title=\"IPTV-数字付费\",金鹰纪实高清",{"$f":"VLOOKUP(A736,txt!A:A,1,0)","v":{"$error":"#N/A"}}]
["239.77.1.217:5146",{"$f":"VLOOKUP(A737,txt!A:A,1,0)","v":"239.77.1.217:5146"}]
["#EXTINF:-1 tvg-name=\"金鹰纪实\" group-title=\"IPTV-数字付费\",金鹰纪实高清测试",{"$f":"VLOOKUP(A738,txt!A:A,1,0)","v":{"$error":"#N/A"}}]
["239.77.0.160:5146",{"$f":"VLOOKUP(A739,txt!A:A,1,0)","v":"239.77.0.160:5146"}]
["#EXTINF:-1 tvg-name=\"金鹰纪实\" group-title=\"IPTV-数字付费\",金鹰纪实超清测试 (CAVS)",{"$f":"VLOOKUP(A740,txt!A:A,1,0)","v":{"$error":"#N/A"}}]
["239.77.0.162:5146",{"$f":"VLOOKUP(A741,txt!A:A,1,0)","v":"239.77.0.162:5146"}]
["#EXTINF:-1 tvg-name=\"上海纪实\" group-title=\"IPTV-数字付费\",上海纪实高清",{"$f":"VLOOKUP(A742,txt!A:A,1,0)","v":{"$error":"#N/A"}}]
["239.77.1.216:5146",{"$f":"VLOOKUP(A743,txt!A:A,1,0)","v":{"$error":"#N/A"}}]
["#EXTINF:-1 tvg-name=\"上海纪实\" group-title=\"IPTV-数字付费\",上海纪实高清",{"$f":"VLOOKUP(A744,txt!A:A,1,0)","v":{"$error":"#N/A"}}]
["239.77.0.147:5146",{"$f":"VLOOKUP(A745,txt!A:A,1,0)","v":{"$error":"#N/A"}}]
["#EXTINF:-1 tvg-name=\"环球奇观\" group-title=\"IPTV-数字付费\",环球奇观",{"$f":"VLOOKUP(A746,txt!A:A,1,0)","v":{"$error":"#N/A"}}]
["239.77.0.224:5146",{"$f":"VLOOKUP(A747,txt!A:A,1,0)","v":{"$error":"#N/A"}}]
["#EXTINF:-1 tvg-name=\"环球奇观\" group-title=\"IPTV-数字付费\",环球奇观",{"$f":"VLOOKUP(A748,txt!A:A,1,0)","v":{"$error":"#N/A"}}]
["239.77.1.198:5146",{"$f":"VLOOKUP(A749,txt!A:A,1,0)","v":"239.77.1.198:5146"}]
["#EXTINF:-1 tvg-name=\"环球奇观\" group-title=\"IPTV-数字付费\",环球奇观",{"$f":"VLOOKUP(A750,txt!A:A,1,0)","v":{"$error":"#N/A"}}]
["239.253.43.126:5146",{"$f":"VLOOKUP(A751,txt!A:A,1,0)","v":"239.253.43.126:5146"}]
["#EXTINF:-1 tvg-name=\"书画\" group-title=\"IPTV-数字付费\",书画频道",{"$f":"VLOOKUP(A752,txt!A:A,1,0)","v":{"$error":"#N/A"}}]
["239.77.1.115:5146",{"$f":"VLOOKUP(A753,txt!A:A,1,0)","v":"239.77.1.115:5146"}]
["#EXTINF:-1 tvg-name=\"游戏竞技\" group-title=\"IPTV-数字付费\",游戏竞技",{"$f":"VLOOKUP(A754,txt!A:A,1,0)","v":{"$error":"#N/A"}}]
["239.77.0.211:5146",{"$f":"VLOOKUP(A755,txt!A:A,1,0)","v":{"$error":"#N/A"}}]
["#EXTINF:-1 tvg-name=\"求索纪录\" group-title=\"IPTV-数字付费\",求索纪录高清",{"$f":"VLOOKUP(A756,txt!A:A,1,0)","v":{"$error":"#N/A"}}]
["239.77.0.21:5146",{"$f":"VLOOKUP(A757,txt!A:A,1,0)","v":"239.77.0.21:5146"}]
["#EXTINF:-1 tvg-name=\"梨园\" group-title=\"IPTV-数字付费\",梨园",{"$f":"VLOOKUP(A758,txt!A:A,1,0)","v":{"$error":"#N/A"}}]
["239.77.0.210:5146",{"$f":"VLOOKUP(A759,txt!A:A,1,0)","v":{"$error":"#N/A"}}]
["#EXTINF:-1 tvg-name=\"武术世界\" group-title=\"IPTV-数字付费\",武术世界",{"$f":"VLOOKUP(A760,txt!A:A,1,0)","v":{"$error":"#N/A"}}]
["239.77.0.216:5146",{"$f":"VLOOKUP(A761,txt!A:A,1,0)","v":{"$error":"#N/A"}}]
["#EXTINF:-1 tvg-name=\"文物宝库\" group-title=\"IPTV-数字付费\",文物宝库",{"$f":"VLOOKUP(A762,txt!A:A,1,0)","v":{"$error":"#N/A"}}]
["239.77.0.227:5146",{"$f":"VLOOKUP(A763,txt!A:A,1,0)","v":{"$error":"#N/A"}}]
["#EXTINF:-1 tvg-name=\"国学\" group-title=\"IPTV-数字付费\",国学",{"$f":"VLOOKUP(A764,txt!A:A,1,0)","v":{"$error":"#N/A"}}]
["239.77.0.226:5146",{"$f":"VLOOKUP(A765,txt!A:A,1,0)","v":"239.77.0.226:5146"}]
["#EXTINF:-1 tvg-name=\"国学\" group-title=\"IPTV-数字付费\",国学频道",{"$f":"VLOOKUP(A766,txt!A:A,1,0)","v":{"$error":"#N/A"}}]
["239.77.1.105:5146",{"$f":"VLOOKUP(A767,txt!A:A,1,0)","v":"239.77.1.105:5146"}]
["#EXTINF:-1 tvg-name=\"汽摩\" group-title=\"IPTV-数字付费\",汽摩",{"$f":"VLOOKUP(A768,txt!A:A,1,0)","v":{"$error":"#N/A"}}]
["239.77.0.209:5146",{"$f":"VLOOKUP(A769,txt!A:A,1,0)","v":"239.77.0.209:5146"}]
["#EXTINF:-1 tvg-name=\"汽摩\" group-title=\"IPTV-数字付费\",汽摩",{"$f":"VLOOKUP(A770,txt!A:A,1,0)","v":{"$error":"#N/A"}}]
["239.77.1.205:5146",{"$f":"VLOOKUP(A771,txt!A:A,1,0)","v":"239.77.1.205:5146"}]
["#EXTINF:-1 tvg-name=\"天元围棋\" group-title=\"IPTV-数字付费\",天元围棋",{"$f":"VLOOKUP(A772,txt!A:A,1,0)","v":{"$error":"#N/A"}}]
["239.253.43.98:5146",{"$f":"VLOOKUP(A773,txt!A:A,1,0)","v":"239.253.43.98:5146"}]
["#EXTINF:-1 tvg-name=\"睛彩\" group-title=\"IPTV-数字付费\",睛彩青少高清",{"$f":"VLOOKUP(A774,txt!A:A,1,0)","v":{"$error":"#N/A"}}]
["239.77.1.22:5146",{"$f":"VLOOKUP(A775,txt!A:A,1,0)","v":"239.77.1.22:5146"}]
["#EXTINF:-1 tvg-name=\"睛彩\" group-title=\"IPTV-数字付费\",睛彩竞技高清",{"$f":"VLOOKUP(A776,txt!A:A,1,0)","v":{"$error":"#N/A"}}]
["239.77.1.20:5146",{"$f":"VLOOKUP(A777,txt!A:A,1,0)","v":"239.77.1.20:5146"}]
["#EXTINF:-1 tvg-name=\"睛彩\" group-title=\"IPTV-数字付费\",睛彩篮球高清",{"$f":"VLOOKUP(A778,txt!A:A,1,0)","v":{"$error":"#N/A"}}]
["239.77.1.21:5146",{"$f":"VLOOKUP(A779,txt!A:A,1,0)","v":"239.77.1.21:5146"}]
["#EXTINF:-1 tvg-name=\"睛彩\" group-title=\"IPTV-数字付费\",睛彩广场舞高清",{"$f":"VLOOKUP(A780,txt!A:A,1,0)","v":{"$error":"#N/A"}}]
["239.77.1.23:5146",{"$f":"VLOOKUP(A781,txt!A:A,1,0)","v":"239.77.1.23:5146"}]
["#EXTINF:-1 tvg-name=\"IPTV1\" group-title=\"IPTV-IPTV频道\",IPTV1",{"$f":"VLOOKUP(A782,txt!A:A,1,0)","v":{"$error":"#N/A"}}]
["239.77.1.75:5146",{"$f":"VLOOKUP(A783,txt!A:A,1,0)","v":{"$error":"#N/A"}}]
["#EXTINF:-1 tvg-name=\"IPTV1\" group-title=\"IPTV-IPTV频道\",IPTV1高清",{"$f":"VLOOKUP(A784,txt!A:A,1,0)","v":{"$error":"#N/A"}}]
["239.77.1.7:5146",{"$f":"VLOOKUP(A785,txt!A:A,1,0)","v":"239.77.1.7:5146"}]
["#EXTINF:-1 tvg-name=\"IPTV1\" group-title=\"IPTV-IPTV频道\",IPTV1高清",{"$f":"VLOOKUP(A786,txt!A:A,1,0)","v":{"$error":"#N/A"}}]
["239.77.1.203:5146",{"$f":"VLOOKUP(A787,txt!A:A,1,0)","v":{"$error":"#N/A"}}]
["#EXTINF:-1 tvg-name=\"IPTV2\" group-title=\"IPTV-IPTV频道\",IPTV2",{"$f":"VLOOKUP(A788,txt!A:A,1,0)","v":{"$error":"#N/A"}}]
["239.77.1.63:5146",{"$f":"VLOOKUP(A789,txt!A:A,1,0)","v":{"$error":"#N/A"}}]
["#EXTINF:-1 tvg-name=\"IPTV2\" group-title=\"IPTV-IPTV频道\",IPTV2高清",{"$f":"VLOOKUP(A790,txt!A:A,1,0)","v":{"$error":"#N/A"}}]
["239.77.1.8:5146",{"$f":"VLOOKUP(A791,txt!A:A,1,0)","v":"239.77.1.8:5146"}]
["#EXTINF:-1 tvg-name=\"IPTV2\" group-title=\"IPTV-IPTV频道\",IPTV2高清",{"$f":"VLOOKUP(A792,txt!A:A,1,0)","v":{"$error":"#N/A"}}]
["239.77.1.201:5146",{"$f":"VLOOKUP(A793,txt!A:A,1,0)","v":{"$error":"#N/A"}}]
["#EXTINF:-1 tvg-name=\"IPTV爱综艺\" group-title=\"IPTV-IPTV频道\",爱综艺",{"$f":"VLOOKUP(A794,txt!A:A,1,0)","v":{"$error":"#N/A"}}]
["239.77.0.107:5146",{"$f":"VLOOKUP(A795,txt!A:A,1,0)","v":"239.77.0.107:5146"}]
["#EXTINF:-1 tvg-name=\"IPTV爱综艺\" group-title=\"IPTV-IPTV频道\",爱综艺",{"$f":"VLOOKUP(A796,txt!A:A,1,0)","v":{"$error":"#N/A"}}]
["239.77.1.78:5146",{"$f":"VLOOKUP(A797,txt!A:A,1,0)","v":"239.77.1.78:5146"}]
["#EXTINF:-1 tvg-name=\"IPTV3\" group-title=\"IPTV-IPTV频道\",IPTV3",{"$f":"VLOOKUP(A798,txt!A:A,1,0)","v":{"$error":"#N/A"}}]
["239.77.1.64:5146",{"$f":"VLOOKUP(A799,txt!A:A,1,0)","v":{"$error":"#N/A"}}]
["#EXTINF:-1 tvg-name=\"IPTV3\" group-title=\"IPTV-IPTV频道\",IPTV3高清",{"$f":"VLOOKUP(A800,txt!A:A,1,0)","v":{"$error":"#N/A"}}]
["239.77.1.9:5146",{"$f":"VLOOKUP(A801,txt!A:A,1,0)","v":"239.77.1.9:5146"}]
["#EXTINF:-1 tvg-name=\"IPTV4\" group-title=\"IPTV-IPTV频道\",IPTV4",{"$f":"VLOOKUP(A802,txt!A:A,1,0)","v":{"$error":"#N/A"}}]
["239.77.1.56:5146",{"$f":"VLOOKUP(A803,txt!A:A,1,0)","v":{"$error":"#N/A"}}]
["#EXTINF:-1 tvg-name=\"IPTV4\" group-title=\"IPTV-IPTV频道\",IPTV4高清",{"$f":"VLOOKUP(A804,txt!A:A,1,0)","v":{"$error":"#N/A"}}]
["239.77.1.10:5146",{"$f":"VLOOKUP(A805,txt!A:A,1,0)","v":"239.77.1.10:5146"}]
["#EXTINF:-1 tvg-name=\"IPTV爱体育\" group-title=\"IPTV-IPTV频道\",爱体育",{"$f":"VLOOKUP(A806,txt!A:A,1,0)","v":{"$error":"#N/A"}}]
["239.77.0.108:5146",{"$f":"VLOOKUP(A807,txt!A:A,1,0)","v":"239.77.0.108:5146"}]
["#EXTINF:-1 tvg-name=\"IPTV爱体育\" group-title=\"IPTV-IPTV频道\",爱体育",{"$f":"VLOOKUP(A808,txt!A:A,1,0)","v":{"$error":"#N/A"}}]
["239.77.1.77:5146",{"$f":"VLOOKUP(A809,txt!A:A,1,0)","v":"239.77.1.77:5146"}]
["#EXTINF:-1 tvg-name=\"IPTV爱体育\" group-title=\"IPTV-IPTV频道\",爱体育高清",{"$f":"VLOOKUP(A810,txt!A:A,1,0)","v":{"$error":"#N/A"}}]
["239.77.0.176:5146",{"$f":"VLOOKUP(A811,txt!A:A,1,0)","v":"239.77.0.176:5146"}]
["#EXTINF:-1 tvg-name=\"IPTV爱体育\" group-title=\"IPTV-IPTV频道\",爱体育高清",{"$f":"VLOOKUP(A812,txt!A:A,1,0)","v":{"$error":"#N/A"}}]
["239.77.1.116:5146",{"$f":"VLOOKUP(A813,txt!A:A,1,0)","v":"239.77.1.116:5146"}]
["#EXTINF:-1 tvg-name=\"IPTV爱电影\" group-title=\"IPTV-IPTV频道\",爱电影",{"$f":"VLOOKUP(A814,txt!A:A,1,0)","v":{"$error":"#N/A"}}]
["239.77.0.103:5146",{"$f":"VLOOKUP(A815,txt!A:A,1,0)","v":"239.77.0.103:5146"}]
["#EXTINF:-1 tvg-name=\"IPTV爱电影\" group-title=\"IPTV-IPTV频道\",爱电影",{"$f":"VLOOKUP(A816,txt!A:A,1,0)","v":{"$error":"#N/A"}}]
["239.77.1.138:5146",{"$f":"VLOOKUP(A817,txt!A:A,1,0)","v":"239.77.1.138:5146"}]
["#EXTINF:-1 tvg-name=\"IPTV爱大剧\" group-title=\"IPTV-IPTV频道\",爱大剧",{"$f":"VLOOKUP(A818,txt!A:A,1,0)","v":{"$error":"#N/A"}}]
["239.77.0.105:5146",{"$f":"VLOOKUP(A819,txt!A:A,1,0)","v":"239.77.0.105:5146"}]
["#EXTINF:-1 tvg-name=\"IPTV爱大剧\" group-title=\"IPTV-IPTV频道\",爱大剧",{"$f":"VLOOKUP(A820,txt!A:A,1,0)","v":{"$error":"#N/A"}}]
["239.77.1.82:5146",{"$f":"VLOOKUP(A821,txt!A:A,1,0)","v":"239.77.1.82:5146"}]
["#EXTINF:-1 tvg-name=\"IPTV谍战剧场\" group-title=\"IPTV-IPTV频道\",IPTV谍战剧场",{"$f":"VLOOKUP(A822,txt!A:A,1,0)","v":{"$error":"#N/A"}}]
["239.77.0.99:5146",{"$f":"VLOOKUP(A823,txt!A:A,1,0)","v":"239.77.0.99:5146"}]
["#EXTINF:-1 tvg-name=\"IPTV谍战剧场\" group-title=\"IPTV-IPTV频道\",IPTV谍战剧场",{"$f":"VLOOKUP(A824,txt!A:A,1,0)","v":{"$error":"#N/A"}}]
["239.77.1.83:5146",{"$f":"VLOOKUP(A825,txt!A:A,1,0)","v":"239.77.1.83:5146"}]
["#EXTINF:-1 tvg-name=\"IPTV相声小品\" group-title=\"IPTV-IPTV频道\",IPTV相声小品",{"$f":"VLOOKUP(A826,txt!A:A,1,0)","v":{"$error":"#N/A"}}]
["239.77.0.100:5146",{"$f":"VLOOKUP(A827,txt!A:A,1,0)","v":"239.77.0.100:5146"}]
["#EXTINF:-1 tvg-name=\"IPTV相声小品\" group-title=\"IPTV-IPTV频道\",IPTV相声小品",{"$f":"VLOOKUP(A828,txt!A:A,1,0)","v":{"$error":"#N/A"}}]
["239.77.1.84:5146",{"$f":"VLOOKUP(A829,txt!A:A,1,0)","v":"239.77.1.84:5146"}]
["#EXTINF:-1 tvg-name=\"IPTV野外\" group-title=\"IPTV-IPTV频道\",IPTV野外",{"$f":"VLOOKUP(A830,txt!A:A,1,0)","v":{"$error":"#N/A"}}]
["239.77.0.101:5146",{"$f":"VLOOKUP(A831,txt!A:A,1,0)","v":"239.77.0.101:5146"}]
["#EXTINF:-1 tvg-name=\"IPTV野外\" group-title=\"IPTV-IPTV频道\",IPTV野外",{"$f":"VLOOKUP(A832,txt!A:A,1,0)","v":{"$error":"#N/A"}}]
["239.77.1.85:5146",{"$f":"VLOOKUP(A833,txt!A:A,1,0)","v":"239.77.1.85:5146"}]
["#EXTINF:-1 tvg-name=\"IPTV法治\" group-title=\"IPTV-IPTV频道\",IPTV法治",{"$f":"VLOOKUP(A834,txt!A:A,1,0)","v":{"$error":"#N/A"}}]
["239.77.0.102:5146",{"$f":"VLOOKUP(A835,txt!A:A,1,0)","v":"239.77.0.102:5146"}]
["#EXTINF:-1 tvg-name=\"IPTV法治\" group-title=\"IPTV-IPTV频道\",IPTV法治",{"$f":"VLOOKUP(A836,txt!A:A,1,0)","v":{"$error":"#N/A"}}]
["239.77.1.86:5146",{"$f":"VLOOKUP(A837,txt!A:A,1,0)","v":"239.77.1.86:5146"}]
["#EXTINF:-1 tvg-name=\"IPTV魅力时尚\" group-title=\"IPTV-IPTV频道\",魅力时尚",{"$f":"VLOOKUP(A838,txt!A:A,1,0)","v":{"$error":"#N/A"}}]
["239.77.0.110:5146",{"$f":"VLOOKUP(A839,txt!A:A,1,0)","v":"239.77.0.110:5146"}]
["#EXTINF:-1 tvg-name=\"IPTV魅力时尚\" group-title=\"IPTV-IPTV频道\",IPTV魅力时尚",{"$f":"VLOOKUP(A840,txt!A:A,1,0)","v":{"$error":"#N/A"}}]
["239.77.1.88:5146",{"$f":"VLOOKUP(A841,txt!A:A,1,0)","v":"239.77.1.88:5146"}]
["#EXTINF:-1 tvg-name=\"IPTV经典电影\" group-title=\"IPTV-IPTV频道\",经典电影",{"$f":"VLOOKUP(A842,txt!A:A,1,0)","v":{"$error":"#N/A"}}]
["239.77.0.104:5146",{"$f":"VLOOKUP(A843,txt!A:A,1,0)","v":"239.77.0.104:5146"}]
["#EXTINF:-1 tvg-name=\"IPTV经典电影\" group-title=\"IPTV-IPTV频道\",IPTV经典电影",{"$f":"VLOOKUP(A844,txt!A:A,1,0)","v":{"$error":"#N/A"}}]
["239.77.1.89:5146",{"$f":"VLOOKUP(A845,txt!A:A,1,0)","v":"239.77.1.89:5146"}]
["#EXTINF:-1 tvg-name=\"IPTV热播剧场\" group-title=\"IPTV-IPTV频道\",热播剧场",{"$f":"VLOOKUP(A846,txt!A:A,1,0)","v":{"$error":"#N/A"}}]
["239.77.0.106:5146",{"$f":"VLOOKUP(A847,txt!A:A,1,0)","v":"239.77.0.106:5146"}]
["#EXTINF:-1 tvg-name=\"IPTV热播剧场\" group-title=\"IPTV-IPTV频道\",IPTV热播剧场",{"$f":"VLOOKUP(A848,txt!A:A,1,0)","v":{"$error":"#N/A"}}]
["239.77.1.90:5146",{"$f":"VLOOKUP(A849,txt!A:A,1,0)","v":"239.77.1.90:5146"}]
["#EXTINF:-1 tvg-name=\"IPTV少儿动画\" group-title=\"IPTV-IPTV频道\",少儿动画",{"$f":"VLOOKUP(A850,txt!A:A,1,0)","v":{"$error":"#N/A"}}]
["239.77.0.109:5146",{"$f":"VLOOKUP(A851,txt!A:A,1,0)","v":"239.77.0.109:5146"}]
["#EXTINF:-1 tvg-name=\"IPTV少儿动画\" group-title=\"IPTV-IPTV频道\",IPTV少儿动画",{"$f":"VLOOKUP(A852,txt!A:A,1,0)","v":{"$error":"#N/A"}}]
["239.77.1.91:5146",{"$f":"VLOOKUP(A853,txt!A:A,1,0)","v":"239.77.1.91:5146"}]
["#EXTINF:-1 tvg-name=\"IPTV收视指南\" group-title=\"IPTV-IPTV频道\",IPTV收视指南",{"$f":"VLOOKUP(A854,txt!A:A,1,0)","v":{"$error":"#N/A"}}]
["239.77.0.111:5146",{"$f":"VLOOKUP(A855,txt!A:A,1,0)","v":"239.77.0.111:5146"}]
["#EXTINF:-1,4k测试频道8",{"$f":"VLOOKUP(A856,txt!A:A,1,0)","v":{"$error":"#N/A"}}]
["239.77.0.249:5146",{"$f":"VLOOKUP(A857,txt!A:A,1,0)","v":{"$error":"#N/A"}}]
["#EXTINF:-1,EBU",{"$f":"VLOOKUP(A858,txt!A:A,1,0)","v":{"$error":"#N/A"}}]
["239.253.43.165:5146",{"$f":"VLOOKUP(A859,txt!A:A,1,0)","v":"239.253.43.165:5146"}]
["#EXTINF:-1,PPTV-1",{"$f":"VLOOKUP(A860,txt!A:A,1,0)","v":{"$error":"#N/A"}}]
["239.77.1.183:5146",{"$f":"VLOOKUP(A861,txt!A:A,1,0)","v":"239.77.1.183:5146"}]
["#EXTINF:-1,PPTV-2",{"$f":"VLOOKUP(A862,txt!A:A,1,0)","v":{"$error":"#N/A"}}]
["239.77.1.184:5146",{"$f":"VLOOKUP(A863,txt!A:A,1,0)","v":"239.77.1.184:5146"}]
["#EXTINF:-1,PPTV-3",{"$f":"VLOOKUP(A864,txt!A:A,1,0)","v":{"$error":"#N/A"}}]
["239.77.1.185:5146",{"$f":"VLOOKUP(A865,txt!A:A,1,0)","v":{"$error":"#N/A"}}]
["#EXTINF:-1,PPTV-4",{"$f":"VLOOKUP(A866,txt!A:A,1,0)","v":{"$error":"#N/A"}}]
["239.77.1.186:5146",{"$f":"VLOOKUP(A867,txt!A:A,1,0)","v":{"$error":"#N/A"}}]
["#EXTINF:-1,Unknown@239.77.0.240:5146",{"$f":"VLOOKUP(A868,txt!A:A,1,0)","v":{"$error":"#N/A"}}]
["239.77.0.240:5146",{"$f":"VLOOKUP(A869,txt!A:A,1,0)","v":"239.77.0.240:5146"}]
["#EXTINF:-1,Unknown@239.77.1.13:5146",{"$f":"VLOOKUP(A870,txt!A:A,1,0)","v":{"$error":"#N/A"}}]
["239.77.1.13:5146",{"$f":"VLOOKUP(A871,txt!A:A,1,0)","v":"239.77.1.13:5146"}]
["#EXTINF:-1,Unknown@239.77.1.14:5146",{"$f":"VLOOKUP(A872,txt!A:A,1,0)","v":{"$error":"#N/A"}}]
["239.77.1.14:5146",{"$f":"VLOOKUP(A873,txt!A:A,1,0)","v":"239.77.1.14:5146"}]
["#EXTINF:-1,九屏同播",{"$f":"VLOOKUP(A874,txt!A:A,1,0)","v":{"$error":"#N/A"}}]
["239.77.1.234:5146",{"$f":"VLOOKUP(A875,txt!A:A,1,0)","v":"239.77.1.234:5146"}]
["#EXTINF:-1,四屏同播",{"$f":"VLOOKUP(A876,txt!A:A,1,0)","v":{"$error":"#N/A"}}]
["239.77.1.107:5146",{"$f":"VLOOKUP(A877,txt!A:A,1,0)","v":"239.77.1.107:5146"}]
["#EXTINF:-1,广东IPTV广告",{"$f":"VLOOKUP(A878,txt!A:A,1,0)","v":{"$error":"#N/A"}}]
["239.77.0.232:5146",{"$f":"VLOOKUP(A879,txt!A:A,1,0)","v":"239.77.0.232:5146"}]
["#EXTINF:-1,广东IPTV广告",{"$f":"VLOOKUP(A880,txt!A:A,1,0)","v":{"$error":"#N/A"}}]
["239.77.0.193:5146",{"$f":"VLOOKUP(A881,txt!A:A,1,0)","v":"239.77.0.193:5146"}]
["#EXTINF:-1,广东IPTV广告",{"$f":"VLOOKUP(A882,txt!A:A,1,0)","v":{"$error":"#N/A"}}]
["239.77.0.190:5146",{"$f":"VLOOKUP(A883,txt!A:A,1,0)","v":"239.77.0.190:5146"}]
["#EXTINF:-1,广东IPTV广告",{"$f":"VLOOKUP(A884,txt!A:A,1,0)","v":{"$error":"#N/A"}}]
["239.77.0.153:5146",{"$f":"VLOOKUP(A885,txt!A:A,1,0)","v":"239.77.0.153:5146"}]
["#EXTINF:-1,广东IPTV广告",{"$f":"VLOOKUP(A886,txt!A:A,1,0)","v":{"$error":"#N/A"}}]
["239.77.0.233:5146",{"$f":"VLOOKUP(A887,txt!A:A,1,0)","v":"239.77.0.233:5146"}]
["#EXTINF:-1,广东IPTV广告",{"$f":"VLOOKUP(A888,txt!A:A,1,0)","v":{"$error":"#N/A"}}]
["239.77.0.191:5146",{"$f":"VLOOKUP(A889,txt!A:A,1,0)","v":"239.77.0.191:5146"}]
["#EXTINF:-1,极K精选-测试",{"$f":"VLOOKUP(A890,txt!A:A,1,0)","v":{"$error":"#N/A"}}]
["239.77.0.231:5146",{"$f":"VLOOKUP(A891,txt!A:A,1,0)","v":{"$error":"#N/A"}}]
["#EXTINF:-1,极k影视-测试",{"$f":"VLOOKUP(A892,txt!A:A,1,0)","v":{"$error":"#N/A"}}]
["239.253.43.218:5146",{"$f":"VLOOKUP(A893,txt!A:A,1,0)","v":{"$error":"#N/A"}}]
["#EXTINF:-1,爱上4K",{"$f":"VLOOKUP(A894,txt!A:A,1,0)","v":{"$error":"#N/A"}}]
["239.253.43.219:5146",{"$f":"VLOOKUP(A895,txt!A:A,1,0)","v":{"$error":"#N/A"}}]
["#EXTINF:-1,百事通高清",{"$f":"VLOOKUP(A896,txt!A:A,1,0)","v":{"$error":"#N/A"}}]
["239.253.43.115:5146",{"$f":"VLOOKUP(A897,txt!A:A,1,0)","v":"239.253.43.115:5146"}]
["#EXTINF:-1,百事通高清",{"$f":"VLOOKUP(A898,txt!A:A,1,0)","v":{"$error":"#N/A"}}]
["239.253.43.116:5146",{"$f":"VLOOKUP(A899,txt!A:A,1,0)","v":"239.253.43.116:5146"}]
["#EXTINF:-1,百事通高清",{"$f":"VLOOKUP(A900,txt!A:A,1,0)","v":{"$error":"#N/A"}}]
["239.253.43.117:5146",{"$f":"VLOOKUP(A901,txt!A:A,1,0)","v":"239.253.43.117:5146"}]
["#EXTINF:-1,百事通高清",{"$f":"VLOOKUP(A902,txt!A:A,1,0)","v":{"$error":"#N/A"}}]
["239.253.43.118:5146",{"$f":"VLOOKUP(A903,txt!A:A,1,0)","v":"239.253.43.118:5146"}]
["#EXTINF:-1,百事通高清",{"$f":"VLOOKUP(A904,txt!A:A,1,0)","v":{"$error":"#N/A"}}]
["239.253.43.119:5146",{"$f":"VLOOKUP(A905,txt!A:A,1,0)","v":"239.253.43.119:5146"}]
["#EXTINF:-1,直播室101",{"$f":"VLOOKUP(A906,txt!A:A,1,0)","v":{"$error":"#N/A"}}]
["239.253.43.217:5146",{"$f":"VLOOKUP(A907,txt!A:A,1,0)","v":{"$error":"#N/A"}}]
["#EXTINF:-1,直播室102",{"$f":"VLOOKUP(A908,txt!A:A,1,0)","v":{"$error":"#N/A"}}]
["239.253.43.153:5146",{"$f":"VLOOKUP(A909,txt!A:A,1,0)","v":{"$error":"#N/A"}}]
["#EXTINF:-1,直播室103",{"$f":"VLOOKUP(A910,txt!A:A,1,0)","v":{"$error":"#N/A"}}]
["239.253.43.154:5146",{"$f":"VLOOKUP(A911,txt!A:A,1,0)","v":{"$error":"#N/A"}}]
["#EXTINF:-1,直播室104",{"$f":"VLOOKUP(A912,txt!A:A,1,0)","v":{"$error":"#N/A"}}]
["239.253.43.155:5146",{"$f":"VLOOKUP(A913,txt!A:A,1,0)","v":{"$error":"#N/A"}}]
["#EXTINF:-1,直播室105",{"$f":"VLOOKUP(A914,txt!A:A,1,0)","v":{"$error":"#N/A"}}]
["239.253.43.156:5146",{"$f":"VLOOKUP(A915,txt!A:A,1,0)","v":{"$error":"#N/A"}}]
["#EXTINF:-1,直播室106",{"$f":"VLOOKUP(A916,txt!A:A,1,0)","v":{"$error":"#N/A"}}]
["239.253.43.157:5146",{"$f":"VLOOKUP(A917,txt!A:A,1,0)","v":{"$error":"#N/A"}}]
["#EXTINF:-1,直播室107",{"$f":"VLOOKUP(A918,txt!A:A,1,0)","v":{"$error":"#N/A"}}]
["239.253.43.158:5146",{"$f":"VLOOKUP(A919,txt!A:A,1,0)","v":{"$error":"#N/A"}}]
["#EXTINF:-1,直播室108",{"$f":"VLOOKUP(A920,txt!A:A,1,0)","v":{"$error":"#N/A"}}]
["239.253.43.160:5146",{"$f":"VLOOKUP(A921,txt!A:A,1,0)","v":{"$error":"#N/A"}}]
["#EXTINF:-1,直播室109",{"$f":"VLOOKUP(A922,txt!A:A,1,0)","v":{"$error":"#N/A"}}]
["239.253.43.161:5146",{"$f":"VLOOKUP(A923,txt!A:A,1,0)","v":{"$error":"#N/A"}}]
["#EXTINF:-1,直播室110",{"$f":"VLOOKUP(A924,txt!A:A,1,0)","v":{"$error":"#N/A"}}]
["239.253.43.162:5146",{"$f":"VLOOKUP(A925,txt!A:A,1,0)","v":{"$error":"#N/A"}}]
["#EXTINF:-1,直播室111",{"$f":"VLOOKUP(A926,txt!A:A,1,0)","v":{"$error":"#N/A"}}]
["239.253.43.163:5146",{"$f":"VLOOKUP(A927,txt!A:A,1,0)","v":{"$error":"#N/A"}}]
["#EXTINF:-1,精选频道1",{"$f":"VLOOKUP(A928,txt!A:A,1,0)","v":{"$error":"#N/A"}}]
["239.77.0.186:5146",{"$f":"VLOOKUP(A929,txt!A:A,1,0)","v":"239.77.0.186:5146"}]
["#EXTINF:-1,网络通道3HD",{"$f":"VLOOKUP(A930,txt!A:A,1,0)","v":{"$error":"#N/A"}}]
["239.77.1.187:5146",{"$f":"VLOOKUP(A931,txt!A:A,1,0)","v":{"$error":"#N/A"}}]
["#EXTINF:-1,网络通道4HD",{"$f":"VLOOKUP(A932,txt!A:A,1,0)","v":{"$error":"#N/A"}}]
["239.77.0.235:5146",{"$f":"VLOOKUP(A933,txt!A:A,1,0)","v":{"$error":"#N/A"}}]