{"text_format":"1","workbook":"xlsx","n_sheets":3,"sheets":["m3u8","txt","Sheet2"],"not_rendered":{"charts":0,"images":0,"macros":1,"external_links":0,"defined_names":3,"comments":0,"pivot_tables":0},"unopened":[],"bounds":{"document_bytes":16777216,"sheet_cells":100000,"rows_first":2000,"rows_last":500,"rows_between":2000,"halvings":0,"cell_chars":16384,"cell_head_chars":4096},"cells_cut":0,"cells_raw":0,"read":"whole","date_system":"1900"}

{"sheet":"m3u8","index":0,"n_rows":934,"n_cols":8,"rows_kept":934,"cut":false,"hidden":false,"merged":[]}
["扫描结果",null,null,null,"匹配","提取信息","信息","m3u8"]
["239.77.0.1:5146","HD (V: h264; A: mp2@2ch)",null,null,{"$f":"IFERROR(VLOOKUP(F2,A:A,1,0),\"-\")","v":"-"},{"$f":"IF(LEFT(H2,1)=\"#\",\"\",MID(H2,FIND(\"rtp\",H2)+4,LEN(H2)-FIND(\"rtp\",H2)-3))","v":""},{"$f":"VLOOKUP(F2,A:B,2,0)","v":{"$error":"#N/A"}},"#EXTINF:-1 tvg-name=\"CCTV -1综合高清\",CCTV -1综合高清"]
["239.77.0.2:5146","4K (V: hevc; A: aac@2ch)",null,null,{"$f":"IFERROR(VLOOKUP(F3,A:A,1,0),\"-\")","v":"239.77.0.86:5146"},{"$f":"IF(LEFT(H3,1)=\"#\",\"\",MID(H3,FIND(\"rtp\",H3)+4,LEN(H3)-FIND(\"rtp\",H3)-3))","v":"239.77.0.86:5146"},{"$f":"VLOOKUP(F3,A:B,2,0)","v":"HD (V: h264; A: mp2@2ch)"},"http://faim.top:12306/rtp/239.77.0.86:5146"]
["239.77.0.3:5146","4K (V: hevc; A: ac3@6ch)",null,null,"-","",{"$f":"VLOOKUP(F4,A:B,2,0)","v":{"$error":"#N/A"}},"#EXTINF:-1 tvg-name=\"CCTV -2财经高清\",CCTV -2财经高清"]
["239.77.0.10:5146","SD (V: h264; A: mp2@2ch)",null,null,"239.77.0.137:5146","239.77.0.137:5146",{"$f":"VLOOKUP(F5,A:B,2,0)","v":"HD (V: h264; A: mp2@2ch)"},"http://faim.top:12306/rtp/239.77.0.137:5146"]
["239.77.0.14:5146","SD (V: h264; A: mp2@2ch)",null,null,"-","",{"$f":"VLOOKUP(F6,A:B,2,0)","v":{"$error":"#N/A"}},"#EXTINF:-1 tvg-name=\"CCTV -7军事农业高清\",CCTV -7军事农业高清"]
["239.77.0.15:5146","HD (V: h264; A: mp2@2ch)",null,null,"239.77.0.138:5146","239.77.0.138:5146",{"$f":"VLOOKUP(F7,A:B,2,0)","v":"HD (V: h264; A: mp2@2ch)"},"http://faim.top:12306/rtp/239.77.0.138:5146"]
["239.77.0.17:5146","HD (V: h264; A: mp2@2ch)",null,null,"-","",{"$f":"VLOOKUP(F8,A:B,2,0)","v":{"$error":"#N/A"}},"#EXTINF:-1 tvg-name=\"CCTV-10科教高清\",CCTV-10科教高清"]
["239.77.0.19:5146","HD (V: h264; A: mp2@2ch)",null,null,"239.77.0.134:5146","239.77.0.134:5146",{"$f":"VLOOKUP(F9,A:B,2,0)","v":"HD (V: h264; A: mp2@2ch)"},"http://faim.top:12306/rtp/239.77.0.134:5146"]
["239.77.0.20:5146","SD (V: h264; A: mp2@2ch)",null,null,"-","",{"$f":"VLOOKUP(F10,A:B,2,0)","v":{"$error":"#N/A"}},"#EXTINF:-1 tvg-name=\"广东卫视\",广东卫视"]
["239.77.0.21:5146","HD (V: h264; A: mp2@2ch)",null,null,"239.77.0.2:5146","239.77.0.2:5146",{"$f":"VLOOKUP(F11,A:B,2,0)","v":"4K (V: hevc; A: aac@2ch)"},"http://faim.top:12306/rtp/239.77.0.2:5146"]
["239.77.0.22:5146","HD (V: h264; A: mp2@2ch)",null,null,"-","",{"$f":"VLOOKUP(F12,A:B,2,0)","v":{"$error":"#N/A"}},"#EXTINF:-1 tvg-name=\"广东珠江\",广东珠江"]
["239.77.0.25:5146","HD (V: h264; A: mp2@2ch)",null,null,"239.77.0.3:5146","239.77.0.3:5146",{"$f":"VLOOKUP(F13,A:B,2,0)","v":"4K (V: hevc; A: ac3@6ch)"},"http://faim.top:12306/rtp/239.77.0.3:5146"]
["239.77.0.28:5146","SD (V: h264; A: mp2@2ch)",null,null,"-","",{"$f":"VLOOKUP(F14,A:B,2,0)","v":{"$error":"#N/A"}},"#EXTINF:-1 tvg-name=\"广东新闻\",广东新闻"]
["239.77.0.30:5146","SD (V: h264; A: mp2@2ch)",null,null,"-","239.77.0.4:5146",{"$f":"VLOOKUP(F15,A:B,2,0)","v":{"$error":"#N/A"}},"http://faim.top:12306/rtp/239.77.0.4:5146"]
["239.77.0.31:5146","SD (V: h264; A: mp2@2ch)",null,null,"-","",{"$f":"VLOOKUP(F16,A:B,2,0)","v":{"$error":"#N/A"}},"#EXTINF:-1 tvg-name=\"广东民生\",广东民生"]
["239.77.0.32:5146","SD (V: h264; A: mp2@2ch)",null,null,"-","239.77.0.5:5146",{"$f":"VLOOKUP(F17,A:B,2,0)","v":{"$error":"#N/A"}},"http://faim.top:12306/rtp/239.77.0.5:5146"]
["239.77.0.33:5146","SD (V: h264; A: mp2@2ch)",null,null,"-","",{"$f":"VLOOKUP(F18,A:B,2,0)","v":{"$error":"#N/A"}},"#EXTINF:-1 tvg-name=\"广东体育\",广东体育"]
["239.77.0.34:5146","SD (V: h264; A: mp2@2ch)",null,null,"-","239.77.0.6:5146",{"$f":"VLOOKUP(F19,A:B,2,0)","v":{"$error":"#N/A"}},"http://faim.top:12306/rtp/239.77.0.6:5146"]
["239.77.0.35:5146","SD (V: h264; A: mp2@2ch)",null,null,"-","",{"$f":"VLOOKUP(F20,A:B,2,0)","v":{"$error":"#N/A"}},"#EXTINF:-1 tvg-name=\"经济科教\",经济科教"]
["239.77.0.36:5146","SD (V: h264; A: mp2@2ch)",null,null,"-","239.77.0.8:5146",{"$f":"VLOOKUP(F21,A:B,2,0)","v":{"$error":"#N/A"}},"http://faim.top:12306/rtp/239.77.0.8:5146"]
["239.77.0.37:5146","SD (V: h264; A: mp2@2ch)",null,null,"-","",{"$f":"VLOOKUP(F22,A:B,2,0)","v":{"$error":"#N/A"}},"#EXTINF:-1 tvg-name=\"大湾区卫视\",大湾区卫视"]
["239.77.0.38:5146","SD (V: h264; A: mp2@2ch)",null,null,"-","239.77.0.9:5146",{"$f":"VLOOKUP(F23,A:B,2,0)","v":{"$error":"#N/A"}},"http://faim.top:12306/rtp/239.77.0.9:5146"]
["239.77.0.39:5146","SD (V: h264; A: mp2@2ch)",null,null,"-","",{"$f":"VLOOKUP(F24,A:B,2,0)","v":{"$error":"#N/A"}},"#EXTINF:-1 tvg-name=\"广东影视\",广东影视"]
["239.77.0.40:5146","SD (V: h264; A: mp2@2ch)",null,null,"-","239.77.0.11:5146",{"$f":"VLOOKUP(F25,A:B,2,0)","v":{"$error":"#N/A"}},"http://faim.top:12306/rtp/239.77.0.11:5146"]
["239.77.0.41:5146","SD (V: h264; A: mp2@2ch)",null,null,"-","",{"$f":"VLOOKUP(F26,A:B,2,0)","v":{"$error":"#N/A"}},"#EXTINF:-1 tvg-name=\"广东少儿\",广东少儿"]
["239.77.0.42:5146","SD (V: h264; A: mp2@2ch)",null,null,"-","239.77.0.12:5146",{"$f":"VLOOKUP(F27,A:B,2,0)","v":{"$error":"#N/A"}},"http://faim.top:12306/rtp/239.77.0.12:5146"]
["239.77.0.43:5146","SD (V: h264; A: mp2@2ch)",null,null,"-","",{"$f":"VLOOKUP(F28,A:B,2,0)","v":{"$error":"#N/A"}},"#EXTINF:-1 tvg-name=\"嘉佳卡通\",嘉佳卡通"]
["239.77.0.44:5146","SD (V: h264; A: mp2@2ch)",null,null,"-","239.77.0.13:5146",{"$f":"VLOOKUP(F29,A:B,2,0)","v":{"$error":"#N/A"}},"http://faim.top:12306/rtp/239.77.0.13:5146"]
["239.77.0.45:5146","SD (V: h264; A: mp2@2ch)",null,null,"-","",{"$f":"VLOOKUP(F30,A:B,2,0)","v":{"$error":"#N/A"}},"#EXTINF:-1 tvg-name=\"广东4K超高清\",广东4K超高清"]
["239.77.0.68:5146","SD (V: h264; A: mp2@2ch)",null,null,"239.77.0.244:5146","239.77.0.244:5146",{"$f":"VLOOKUP(F31,A:B,2,0)","v":"4K (V: hevc; A: ac3@2ch)"},"http://faim.top:12306/rtp/239.77.0.244:5146"]
["239.77.0.69:5146","SD (V: h264; A: mp2@2ch)",null,null,"-","",{"$f":"VLOOKUP(F32,A:B,2,0)","v":{"$error":"#N/A"}},"#EXTINF:-1 tvg-name=\"广东4K超高清 窄色域 30\",广东4K超高清 窄色域 30"]
["239.77.0.70:5146","SD (V: h264; A: mp2@2ch)",null,null,"239.77.0.245:5146","239.77.0.245:5146",{"$f":"VLOOKUP(F33,A:B,2,0)","v":"4K (V: hevc; A: aac@2ch)"},"http://faim.top:12306/rtp/239.77.0.245:5146"]
["239.77.0.73:5146","SD (V: h264; A: mp2@2ch)",null,null,"-","",{"$f":"VLOOKUP(F34,A:B,2,0)","v":{"$error":"#N/A"}},"#EXTINF:-1 tvg-name=\"南方购物-精选\",南方购物-精选"]
["239.77.0.74:5146","SD (V: h264; A: mp2@2ch)",null,null,"239.77.0.19:5146","239.77.0.19:5146",{"$f":"VLOOKUP(F35,A:B,2,0)","v":"HD (V: h264; A: mp2@2ch)"},"http://faim.top:12306/rtp/239.77.0.19:5146"]
["239.77.0.75:5146","SD (V: h264; A: mp2@2ch)",null,null,"-","",{"$f":"VLOOKUP(F36,A:B,2,0)","v":{"$error":"#N/A"}},"#EXTINF:-1 tvg-name=\"广东4K超高清 宽色域AVS2\",广东4K超高清 宽色域AVS2"]
["239.77.0.77:5146","SD (V: h264; A: mp2@2ch)",null,null,"239.77.0.252:5146","239.77.0.252:5146",{"$f":"VLOOKUP(F37,A:B,2,0)","v":"4K (V: avs2; A: ac3@6ch)"},"http://faim.top:12306/rtp/239.77.0.252:5146"]
["239.77.0.78:5146","HD (V: h264; A: mp2@2ch)",null,null,"-","",{"$f":"VLOOKUP(F38,A:B,2,0)","v":{"$error":"#N/A"}},"#EXTINF:-1 tvg-name=\"广东移动\",广东移动"]
["239.77.0.79:5146","SD (V: h264; A: mp2@2ch)",null,null,"239.77.0.20:5146","239.77.0.20:5146",{"$f":"VLOOKUP(F39,A:B,2,0)","v":"SD (V: h264; A: mp2@2ch)"},"http://faim.top:12306/rtp/239.77.0.20:5146"]
["239.77.0.81:5146","SD (V: h264; A: mp2@1ch)",null,null,"-","",{"$f":"VLOOKUP(F40,A:B,2,0)","v":{"$error":"#N/A"}},"#EXTINF:-1 tvg-name=\"肇庆新闻综合\",肇庆新闻综合"]
{"$rows_left_out":895}
{"sheet":"txt","index":1,"n_rows":384,"n_cols":8,"rows_kept":384,"cut":false,"hidden":false,"merged":[]}
["扫描结果",null,null,null,"匹配","提取信息","信息","txt"]
["239.77.0.1:5146","HD (V: h264; A: mp2@2ch)",null,null,{"$f":"VLOOKUP(F2,A:A,1,0)","v":"239.77.1.19:5146"},{"$f":"MID(H2,FIND(\"/rtp/\",H2)+5,LEN(H2)-FIND(\"/rtp/\",H2)-4)","v":"239.77.1.19:5146"},{"$f":"VLOOKUP(F2,A:B,2,0)","v":"HD (V: h264; A: mp2@2ch)"},"广东卫视高清,http://faim.top:12306/rtp/239.77.1.19:5146"]
["239.77.0.2:5146","4K (V: hevc; A: aac@2ch)",null,null,{"$f":"VLOOKUP(F3,A:A,1,0)","v":"239.77.1.152:5146"},{"$f":"MID(H3,FIND(\"/rtp/\",H3)+5,LEN(H3)-FIND(\"/rtp/\",H3)-4)","v":"239.77.1.152:5146"},{"$f":"VLOOKUP(F3,A:B,2,0)","v":"HD (V: mpeg2video; A: ac3@6ch)"},"广东卫视高清,http://faim.top:12306/rtp/239.77.1.152:5146"]
["239.77.0.3:5146","4K (V: hevc; A: ac3@6ch)",null,null,"239.77.0.84:5146","239.77.0.84:5146","HD (V: h264; A: mp2@2ch)","广东卫视高清,http://faim.top:12306/rtp/239.77.0.84:5146"]
["239.77.0.10:5146","SD (V: h264; A: mp2@2ch)",null,null,"239.77.0.166:5146","239.77.0.166:5146","HD (V: h264; A: mp2@2ch)","广东卫视超清,http://faim.top:12306/rtp/239.77.0.166:5146"]
["239.77.0.14:5146","SD (V: h264; A: mp2@2ch)",null,null,"239.77.0.3:5146","239.77.0.3:5146","4K (V: hevc; A: ac3@6ch)","广东珠江,http://faim.top:12306/rtp/239.77.0.3:5146"]
["239.77.0.15:5146","HD (V: h264; A: mp2@2ch)",null,null,"239.77.1.94:5146","239.77.1.94:5146","SD (V: h264; A: mp2@2ch)","广东珠江,http://faim.top:12306/rtp/239.77.1.94:5146"]
["239.77.0.17:5146","HD (V: h264; A: mp2@2ch)",null,null,"239.77.0.1:5146","239.77.0.1:5146","HD (V: h264; A: mp2@2ch)","广东珠江高清,http://faim.top:12306/rtp/239.77.0.1:5146"]
["239.77.0.19:5146","HD (V: h264; A: mp2@2ch)",null,null,"239.77.0.114:5146","239.77.0.114:5146","HD (V: h264; A: mp2@2ch)","广东珠江超清,http://faim.top:12306/rtp/239.77.0.114:5146"]
["239.77.0.20:5146","SD (V: h264; A: mp2@2ch)",null,null,"239.77.0.173:5146","239.77.0.173:5146","HD (V: h264; A: mp2@2ch)","广东新闻高清,http://faim.top:12306/rtp/239.77.0.173:5146"]
["239.77.0.21:5146","HD (V: h264; A: mp2@2ch)",null,null,"239.77.0.225:5146","239.77.0.225:5146","HD (V: h264; A: mp2@2ch)","广东民生高清,http://faim.top:12306/rtp/239.77.0.225:5146"]
["239.77.0.22:5146","HD (V: h264; A: mp2@2ch)",null,null,"239.77.1.97:5146","239.77.1.97:5146","SD (V: h264; A: mp2@2ch)","广东体育（深圳）,http://faim.top:12306/rtp/239.77.1.97:5146"]
["239.77.0.25:5146","HD (V: h264; A: mp2@2ch)",null,null,"239.77.0.112:5146","239.77.0.112:5146","HD (V: h264; A: mp2@2ch)","广东体育高清-测试,http://faim.top:12306/rtp/239.77.0.112:5146"]
["239.77.0.28:5146","SD (V: h264; A: mp2@2ch)",null,null,"239.77.0.168:5146","239.77.0.168:5146","HD (V: h264; A: mp2@2ch)","广东体育超清,http://faim.top:12306/rtp/239.77.0.168:5146"]
["239.77.0.30:5146","SD (V: h264; A: mp2@2ch)",null,null,"239.77.0.85:5146","239.77.0.85:5146","HD (V: h264; A: mp2@2ch)","经济科教高清,http://faim.top:12306/rtp/239.77.0.85:5146"]
["239.77.0.31:5146","SD (V: h264; A: mp2@2ch)",null,null,"239.77.0.167:5146","239.77.0.167:5146","HD (V: h264; A: mp2@2ch)","经济科教超清,http://faim.top:12306/rtp/239.77.0.167:5146"]
["239.77.0.32:5146","SD (V: h264; A: mp2@2ch)",null,null,"239.77.1.12:5146","239.77.1.12:5146","SD (V: h264; A: mp2@2ch)","大湾区卫视,http://faim.top:12306/rtp/239.77.1.12:5146"]
["239.77.0.33:5146","SD (V: h264; A: mp2@2ch)",null,null,"239.77.0.215:5146","239.77.0.215:5146","HD (V: h264; A: mp2@2ch)","大湾区卫视高清,http://faim.top:12306/rtp/239.77.0.215:5146"]
["239.77.0.34:5146","SD (V: h264; A: mp2@2ch)",null,null,"239.77.0.217:5146","239.77.0.217:5146","HD (V: h264; A: mp2@2ch)","广东影视高清,http://faim.top:12306/rtp/239.77.0.217:5146"]
["239.77.0.35:5146","SD (V: h264; A: mp2@2ch)",null,null,"239.77.0.250:5146","239.77.0.250:5146","HD (V: h264; A: mp2@2ch)","广东少儿高清,http://faim.top:12306/rtp/239.77.0.250:5146"]
["239.77.0.36:5146","SD (V: h264; A: mp2@2ch)",null,null,"239.77.1.15:5146","239.77.1.15:5146","SD (V: h264; A: mp2@2ch)","嘉佳卡通,http://faim.top:12306/rtp/239.77.1.15:5146"]
["239.77.0.37:5146","SD (V: h264; A: mp2@2ch)",null,null,"239.77.0.179:5146","239.77.0.179:5146","HD (V: h264; A: mp2@2ch)","嘉佳卡通高清,http://faim.top:12306/rtp/239.77.0.179:5146"]
["239.77.0.38:5146","SD (V: h264; A: mp2@2ch)",null,null,"239.77.0.19:5146","239.77.0.19:5146","HD (V: h264; A: mp2@2ch)","南方购物-精选,http://faim.top:12306/rtp/239.77.0.19:5146"]
["239.77.0.39:5146","SD (V: h264; A: mp2@2ch)",null,null,"239.77.0.22:5146","239.77.0.22:5146","HD (V: h264; A: mp2@2ch)","南方购物,http://faim.top:12306/rtp/239.77.0.22:5146"]
["239.77.0.40:5146","SD (V: h264; A: mp2@2ch)",null,null,"239.77.0.241:5146","239.77.0.241:5146","SD (V: h264; A: mp2@2ch)","南方购物高清,http://faim.top:12306/rtp/239.77.0.241:5146"]
["239.77.0.41:5146","SD (V: h264; A: mp2@2ch)",null,null,"239.77.0.122:5146","239.77.0.122:5146","HD (V: h264; A: mp2@2ch)","岭南戏曲高清,http://faim.top:12306/rtp/239.77.0.122:5146"]
["239.77.0.42:5146","SD (V: h264; A: mp2@2ch)",null,null,"239.77.0.213:5146","239.77.0.213:5146","HD (V: h264; A: mp2@2ch)","现代教育高清,http://faim.top:12306/rtp/239.77.0.213:5146"]
["239.77.0.43:5146","SD (V: h264; A: mp2@2ch)",null,null,"239.77.0.20:5146","239.77.0.20:5146","SD (V: h264; A: mp2@2ch)","广东移动,http://faim.top:12306/rtp/239.77.0.20:5146"]
["239.77.0.44:5146","SD (V: h264; A: mp2@2ch)",null,null,"239.77.1.237:5146","239.77.1.237:5146","4K (V: hevc; A: aac@2ch)","广东综艺 4K,http://faim.top:12306/rtp/239.77.1.237:5146"]
["239.77.0.45:5146","SD (V: h264; A: mp2@2ch)",null,null,"239.77.0.244:5146","239.77.0.244:5146","4K (V: hevc; A: ac3@2ch)","广东综艺(4k),http://faim.top:12306/rtp/239.77.0.244:5146"]
["239.77.0.68:5146","SD (V: h264; A: mp2@2ch)",null,null,"239.77.0.245:5146","239.77.0.245:5146","4K (V: hevc; A: aac@2ch)","广东综艺(4k),http://faim.top:12306/rtp/239.77.0.245:5146"]
["239.77.0.69:5146","SD (V: h264; A: mp2@2ch)",null,null,"239.77.0.252:5146","239.77.0.252:5146","4K (V: avs2; A: ac3@6ch)","广东综艺 宽色域AVS2(4k) (AVS2),http://faim.top:12306/rtp/239.77.0.252:5146"]
["239.77.0.70:5146","SD (V: h264; A: mp2@2ch)",null,null,"239.253.43.71:5146","239.253.43.71:5146","HD (V: h264; A: mp2@2ch)","广州综合高清,http://faim.top:12306/rtp/239.253.43.71:5146"]
["239.77.0.73:5146","SD (V: h264; A: mp2@2ch)",null,null,"239.253.43.72:5146","239.253.43.72:5146","HD (V: h264; A: mp2@2ch)","广州新闻高清,http://faim.top:12306/rtp/239.253.43.72:5146"]
["239.77.0.74:5146","SD (V: h264; A: mp2@2ch)",null,null,"239.253.43.73:5146","239.253.43.73:5146","HD (V: h264; A: mp2@2ch)","广州影视高清,http://faim.top:12306/rtp/239.253.43.73:5146"]
["239.77.0.75:5146","SD (V: h264; A: mp2@2ch)",null,null,"239.253.43.74:5146","239.253.43.74:5146","HD (V: h264; A: mp2@2ch)","广州法治高清,http://faim.top:12306/rtp/239.253.43.74:5146"]
["239.77.0.77:5146","SD (V: h264; A: mp2@2ch)",null,null,"239.253.43.99:5146","239.253.43.99:5146","4K (V: hevc; A: aac@2ch)","南国都市 4K,http://faim.top:12306/rtp/239.253.43.99:5146"]
["239.77.0.78:5146","HD (V: h264; A: mp2@2ch)",null,null,"239.77.1.3:5146","239.77.1.3:5146","HD (V: h264; A: mp2@2ch)","深圳卫视高清,http://faim.top:12306/rtp/239.77.1.3:5146"]
["239.77.0.79:5146","SD (V: h264; A: mp2@2ch)",null,null,"239.77.1.148:5146","239.77.1.148:5146","HD (V: h264; A: mp2@2ch)","深圳卫视高清,http://faim.top:12306/rtp/239.77.1.148:5146"]
["239.77.0.81:5146","SD (V: h264; A: mp2@1ch)",null,null,"239.77.0.92:5146","239.77.0.92:5146","HD (V: h264; A: mp2@2ch)","深圳卫视高清,http://faim.top:12306/rtp/239.77.0.92:5146"]
{"$rows_left_out":345}
{"sheet":"Sheet2","index":2,"n_rows":933,"n_cols":2,"rows_kept":933,"cut":false,"hidden":false,"merged":[]}
["#EXTM3U name=\"广东电信IPTV\""]
["#EXTINF:-1 tvg-name=\"广东卫视\" group-title=\"IPTV-广东电视台\",广东卫视高清"]
["239.77.1.19:5146",{"$f":"VLOOKUP(A3,txt!A:A,1,0)","v":"239.77.1.19:5146"}]
["#EXTINF:-1 tvg-name=\"广东卫视\" group-title=\"IPTV-广东电视台\",广东卫视高清",{"$f":"VLOOKUP(A4,txt!A:A,1,0)","v":{"$error":"#N/A"}}]
["239.77.1.152:5146",{"$f":"VLOOKUP(A5,txt!A:A,1,0)","v":"239.77.1.152:5146"}]
["#EXTINF:-1 tvg-name=\"广东卫视\" group-title=\"IPTV-广东电视台\",广东卫视高清",{"$f":"VLOOKUP(A6,txt!A:A,1,0)","v":{"$error":"#N/A"}}]
["239.77.0.84:5146",{"$f":"VLOOKUP(A7,txt!A:A,1,0)","v":"239.77.0.84:5146"}]
["#EXTINF:-1 tvg-name=\"广东卫视\" group-title=\"IPTV-广东电视台\",广东卫视超清",{"$f":"VLOOKUP(A8,txt!A:A,1,0)","v":{"$error":"#N/A"}}]
["239.77.0.166:5146",{"$f":"VLOOKUP(A9,txt!A:A,1,0)","v":"239.77.0.166:5146"}]
["#EXTINF:-1 tvg-name=\"广东珠江\" group-title=\"IPTV-广东电视台\",广东珠江",{"$f":"VLOOKUP(A10,txt!A:A,1,0)","v":{"$error":"#N/A"}}]
["239.77.0.3:5146",{"$f":"VLOOKUP(A11,txt!A:A,1,0)","v":"239.77.0.3:5146"}]
["#EXTINF:-1 tvg-name=\"广东珠江\" group-title=\"IPTV-广东电视台\",广东珠江",{"$f":"VLOOKUP(A12,txt!A:A,1,0)","v":{"$error":"#N/A"}}]
["239.77.1.94:5146",{"$f":"VLOOKUP(A13,txt!A:A,1,0)","v":"239.77.1.94:5146"}]
["#EXTINF:-1 tvg-name=\"广东珠江\" group-title=\"IPTV-广东电视台\",广东珠江高清",{"$f":"VLOOKUP(A14,txt!A:A,1,0)","v":{"$error":"#N/A"}}]
["239.77.0.1:5146",{"$f":"VLOOKUP(A15,txt!A:A,1,0)","v":"239.77.0.1:5146"}]
["#EXTINF:-1 tvg-name=\"广东珠江\" group-title=\"IPTV-广东电视台\",广东珠江超清",{"$f":"VLOOKUP(A16,txt!A:A,1,0)","v":{"$error":"#N/A"}}]
["239.77.0.114:5146",{"$f":"VLOOKUP(A17,txt!A:A,1,0)","v":"239.77.0.114:5146"}]
["#EXTINF:-1 tvg-name=\"广东新闻\" group-title=\"IPTV-广东电视台\",广东新闻",{"$f":"VLOOKUP(A18,txt!A:A,1,0)","v":{"$error":"#N/A"}}]
["239.77.0.4:5146",{"$f":"VLOOKUP(A19,txt!A:A,1,0)","v":{"$error":"#N/A"}}]
["#EXTINF:-1 tvg-name=\"广东新闻\" group-title=\"IPTV-广东电视台\",广东新闻高清",{"$f":"VLOOKUP(A20,txt!A:A,1,0)","v":{"$error":"#N/A"}}]
["239.77.0.173:5146",{"$f":"VLOOKUP(A21,txt!A:A,1,0)","v":"239.77.0.173:5146"}]
["#EXTINF:-1 tvg-name=\"广东民生\" group-title=\"IPTV-广东电视台\",广东民生",{"$f":"VLOOKUP(A22,txt!A:A,1,0)","v":{"$error":"#N/A"}}]
["239.77.0.5:5146",{"$f":"VLOOKUP(A23,txt!A:A,1,0)","v":{"$error":"#N/A"}}]
["#EXTINF:-1 tvg-name=\"广东民生\" group-title=\"IPTV-广东电视台\",广东民生高清",{"$f":"VLOOKUP(A24,txt!A:A,1,0)","v":{"$error":"#N/A"}}]
["239.77.0.225:5146",{"$f":"VLOOKUP(A25,txt!A:A,1,0)","v":"239.77.0.225:5146"}]
["#EXTINF:-1 tvg-name=\"广东体育\" group-title=\"IPTV-广东电视台\",广东体育",{"$f":"VLOOKUP(A26,txt!A:A,1,0)","v":{"$error":"#N/A"}}]
["239.77.0.6:5146",{"$f":"VLOOKUP(A27,txt!A:A,1,0)","v":{"$error":"#N/A"}}]
["#EXTINF:-1 tvg-name=\"广东体育\" group-title=\"IPTV-广东电视台\",广东体育（深圳）",{"$f":"VLOOKUP(A28,txt!A:A,1,0)","v":{"$error":"#N/A"}}]
["239.77.1.97:5146",{"$f":"VLOOKUP(A29,txt!A:A,1,0)","v":"239.77.1.97:5146"}]
["#EXTINF:-1 tvg-name=\"广东体育\" group-title=\"IPTV-广东电视台\",广东体育高清-测试",{"$f":"VLOOKUP(A30,txt!A:A,1,0)","v":{"$error":"#N/A"}}]
["239.77.0.112:5146",{"$f":"VLOOKUP(A31,txt!A:A,1,0)","v":"239.77.0.112:5146"}]
["#EXTINF:-1 tvg-name=\"广东体育\" group-title=\"IPTV-广东电视台\",广东体育超清",{"$f":"VLOOKUP(A32,txt!A:A,1,0)","v":{"$error":"#N/A"}}]
["239.77.0.168:5146",{"$f":"VLOOKUP(A33,txt!A:A,1,0)","v":"239.77.0.168:5146"}]
["#EXTINF:-1 tvg-name=\"广东国际\" group-title=\"IPTV-广东电视台\",广东国际",{"$f":"VLOOKUP(A34,txt!A:A,1,0)","v":{"$error":"#N/A"}}]
["239.77.0.7:5146",{"$f":"VLOOKUP(A35,txt!A:A,1,0)","v":{"$error":"#N/A"}}]
["#EXTINF:-1 tvg-name=\"经济科教\" group-title=\"IPTV-广东电视台\",经济科教",{"$f":"VLOOKUP(A36,txt!A:A,1,0)","v":{"$error":"#N/A"}}]
["239.77.0.8:5146",{"$f":"VLOOKUP(A37,txt!A:A,1,0)","v":{"$error":"#N/A"}}]
["#EXTINF:-1 tvg-name=\"经济科教\" group-title=\"IPTV-广东电视台\",经济科教高清",{"$f":"VLOOKUP(A38,txt!A:A,1,0)","v":{"$error":"#N/A"}}]
["239.77.0.85:5146",{"$f":"VLOOKUP(A39,txt!A:A,1,0)","v":"239.77.0.85:5146"}]
["#EXTINF:-1 tvg-name=\"经济科教\" group-title=\"IPTV-广东电视台\",经济科教超清",{"$f":"VLOOKUP(A40,txt!A:A,1,0)","v":{"$error":"#N/A"}}]
{"$rows_left_out":893}